program: Gaussian 09
title: 000177363
version: EM64L-G09RevD.01
frameworkgroup: C1[X(C10H19NO3)]
method: RPBEPBE
basis: SDD
operation: Freq
keyword: #p
keyword: freq=noraman
keyword: PBEPBE/SDD
title: #p freq=noraman PBEPBE/SDD
converged: YES YES NO NO
title: Mulliken charges:
elementType: O O O N C C C C C C C C C C H H H H H H H H H H H H H H H H H H H
charge: -0.209761 -0.419066 -0.236688 -0.545690 -0.376267 -0.425631 -0.374040 -0.130029 -0.521440 0.181401 -0.718109 -0.213964 0.164074 -0.681339 0.206484 0.193043 0.204842 0.225515 0.226833 0.224681 0.253021 0.235520 0.231722 0.235690 0.219670 0.224203 0.224039 0.224094 0.207338 0.250901 0.280420 0.267161 0.371373
chargesum: 0.00000
title: Mulliken charges with hydrogens summed into heavy atoms:
elementType: O O O N C C C C C C C C C C
charge: -0.209761 -0.047692 -0.236688 0.001890 0.023259 0.004726 0.077474 0.122992 -0.054198 0.181401 -0.038547 0.010075 0.164074 0.000993
polarizability: 1.43643103e+02 4.25444066e+00 1.17856993e+02 -3.95458294e+00 3.19102254e+00 1.07436855e+02
1716.lowfreq: -23.0758 -9.4640 -7.5262 -0.0009 -0.0008 -0.0007 1.6564 18.3959 29.0645
frequency: -9.8375 17.1105 28.9372 37.2104 63.8335 72.7248 88.4589 138.9861 159.8345 199.2929 212.7955 216.6727 225.0553 239.9380 257.5021 272.8626 282.0079 318.4535 352.9902 428.4471 454.7027 509.1430 570.7763 583.8778 627.4599 650.3948 712.6783 728.3779 735.6921 754.5051 793.9999 824.9403 862.1660 894.7553 905.2958 966.9349 983.4036 1002.5356 1019.7936 1040.3295 1050.8855 1069.3882 1075.5405 1092.0734 1107.3744 1118.2491 1141.8544 1150.0431 1211.1324 1239.5667 1242.1597 1253.1092 1267.3739 1272.2049 1286.9380 1306.3215 1331.0542 1339.5250 1359.1099 1363.4712 1368.7300 1378.2806 1389.4980 1427.5497 1454.8374 1463.5331 1466.5714 1472.8059 1475.6965 1480.1560 1482.3333 1624.8470 1652.9604 1662.3347 2943.5374 2961.9022 2977.9480 2986.8009 2987.3707 2996.0541 2998.0207 3001.5922 3010.3236 3034.3329 3053.8334 3061.0018 3083.1379 3085.8251 3095.5161 3104.6716 3422.1672 3494.2522 3542.1982
redmass: 4.5565 4.0923 8.1735 4.5537 4.1855 3.4556 1.9467 3.2809 2.9621 1.2439 1.6641 1.4768 1.1619 3.1293 2.7520 2.2326 2.7180 3.5934 2.9411 2.9710 3.3654 2.6658 2.1765 3.6414 1.2556 2.6759 1.5987 3.6831 1.8093 1.7056 3.1519 1.7199 1.8995 2.1084 1.9334 1.4437 1.7037 2.7946 2.2456 1.9565 1.7443 2.1680 2.2551 1.5775 2.2338 2.4982 1.8884 1.6383 1.4537 1.6455 1.6640 1.3168 1.3229 1.4069 1.2304 1.1350 1.5350 1.3813 1.2926 1.5864 1.6230 1.2203 1.2362 1.0876 1.0864 1.0477 1.0733 1.0473 1.0546 1.0929 1.0585 8.3619 1.0893 7.8133 1.0638 1.0597 1.0623 1.0351 1.0351 1.0639 1.0808 1.0917 1.0980 1.0953 1.0930 1.1033 1.0998 1.1002 1.1000 1.1003 1.0453 1.0636 1.0952
irintensity: 1.1266 0.5384 2.2455 0.8582 0.8280 1.3020 1.4586 2.4477 0.2782 50.9693 2.7474 1.2170 3.0634 3.0496 2.4078 3.4409 5.2581 29.5569 3.6895 2.5535 13.5775 4.9872 3.1090 9.6667 129.1231 19.4903 21.2892 31.0901 258.1590 4.7048 0.9316 0.2614 7.4331 0.3268 0.5958 6.9450 1.0438 51.0077 90.7911 106.6344 49.5514 16.2043 21.5342 25.6991 17.7722 7.2683 2.2096 6.7099 13.1055 5.5115 6.1431 9.3324 7.4307 9.4183 5.6616 4.2441 12.4942 13.7701 1.4773 0.7465 11.0561 19.4357 25.8235 16.4284 10.6281 14.3870 1.8432 17.3073 10.6003 16.4017 11.7417 78.2360 42.1905 194.7305 15.3190 30.3701 18.8763 16.3073 31.5195 7.7502 37.2701 19.8376 22.0647 7.2300 24.9645 49.4254 37.2027 30.9661 29.0048 21.1026 1.3730 15.5781 1.4529
temp: 298.150 k
press: 1.00000 atm
elementType: 8 8 8 7 6 6 6 6 6 6 6 6 6 6 1 1 1 1 1 1 1 1 1 1 1 1 1 1 1 1 1 1 1
symmnumber: 1
zpe: 736617.7 jmol-1
zpe.correction: 0.280563 hartree
zpe.thermalcorrener: 0.297188 hartree
zpe.thermalcorrenthalpy: 0.298132 hartree
zpe.thermalcorrgfe: 0.234023 hartree
zpe.sumelectzpe: -671.753949 hartree
zpe.sumelectthermal: -671.737324 hartree
zpe.sumelectthermalent: -671.736380 hartree
zpe.sumelectthermalfe: -671.800489 hartree
dipole: 0.1317 0.1056 1.1242
dipole: 1.1368
quadrupole: -102.9366 -79.9546 -87.5870
quadrupole: 2.4840 10.3003 -3.9909
quadrupole: -12.7772 10.2048 2.5724 2.4840 10.3003 -3.9909
hfenergy: -672.0345116 hartree
pointgroup: C01 [X(C10H19N1O3)]
dipole: -0.0443064 0.0396132 0.443286 debye
polarizability: 144.204758|3.0968811|115.93859|2.4367304|-5.0129458|108.7936025 unknown
InChI: InChI=1S/C10H19NO3/c1-7(10(13)14)5-3-4-6-9(12)8(2)11/h7-8,13H,3-6,11H2,1-2H3
charge 0 multiplicity 1
33 atoms
O  -2.709469 1.169206 -1.319575
O  2.1588 -2.087907 -0.336337
O  3.956344 -1.33894 0.923434
N  -5.271495 0.620762 -0.154945
C  1.026031 0.969648 0.981325
C  2.374219 1.289245 0.292214
C  -0.166597 0.852427 0.006007
C  2.889564 0.20133 -0.699778
C  -1.502626 0.625256 0.739282
C  -2.73274 0.654192 -0.168456
C  4.227323 0.636565 -1.34737
C  -4.039071 0.016238 0.379878
C  3.091241 -1.107337 0.049401
C  -4.013406 -1.498097 0.039373
H  1.120172 0.034757 1.571573
H  0.815473 1.775146 1.714922
H  2.278837 2.23574 -0.276627
H  3.155502 1.447943 1.061048
H  -0.004109 0.016451 -0.699914
H  -0.246834 1.768873 -0.609045
H  2.134375 0.029028 -1.48563
H  -1.492371 -0.327141 1.307664
H  -1.654983 1.418672 1.505572
H  5.009932 0.749965 -0.57673
H  4.096894 1.604541 -1.863253
H  4.578813 -0.102875 -2.088892
H  -4.045316 0.123453 1.482719
H  -4.01591 -1.640769 -1.056955
H  -3.120221 -2.001577 0.451226
H  -4.917485 -1.972296 0.455632
H  -5.281518 0.599569 -1.183592
H  -5.421956 1.58198 0.175883
H  2.331685 -2.921246 0.183046
