program: Gaussian 09
title: 000177462
version: EM64L-G09RevD.01
frameworkgroup: C1[X(C17H23NO4)]
method: RPBEPBE
basis: SDD
operation: Freq
keyword: #p
keyword: freq=noraman
keyword: PBEPBE/SDD
title: #p freq=noraman PBEPBE/SDD
converged: NO YES NO NO
title: Mulliken charges:
elementType: O O O O N C C C C C C C C C C C C C C C C C H H H H H H H H H H H H H H H H H H H H H H H
charge: -0.266166 -0.246417 -0.317870 -0.306601 -0.120926 0.113449 -0.440219 -0.458048 -0.440110 -0.453126 0.429115 0.187363 -0.372911 -0.409457 0.300902 -0.257236 -0.245583 -0.241331 -0.225993 -0.206767 -0.674993 -0.677925 0.230270 0.233787 0.232500 0.211306 0.258576 0.244259 0.224098 0.259773 0.256032 0.248876 0.227192 0.225126 0.230086 0.230784 0.229498 0.225857 0.224257 0.214210 0.233714 0.227603 0.225647 0.226787 0.210612
chargesum: 0.00000
title: Mulliken charges with hydrogens summed into heavy atoms:
elementType: O O O O N C C C C C C C C C C C C C C C C C
charge: -0.266166 -0.246417 -0.317870 -0.306601 -0.120926 0.113449 0.023838 -0.014242 0.062725 0.030745 0.429115 0.187363 -0.116879 -0.160581 0.300902 -0.030044 -0.020457 -0.011245 0.234289 0.243346 0.000534 -0.014879
polarizability: 2.41023592e+02 -1.53574781e+01 1.76727800e+02 2.69155214e+00 3.82406181e+00 1.85561907e+02
1716.lowfreq: -10.8481 -0.0009 -0.0009 -0.0007 5.7126 6.5972 17.3096 21.2676 29.5875
frequency: 17.1250 19.3777 29.4938 42.6940 60.1808 66.4447 76.0698 87.5564 102.3605 116.6676 127.4058 141.0831 163.2413 186.5853 231.1577 239.2320 247.4818 258.4496 275.1500 293.6993 324.0174 340.3287 345.3072 364.1838 383.8310 404.3042 423.5310 445.7051 487.2849 515.9241 534.5680 553.6718 610.8563 617.9374 640.5564 689.8877 699.3890 707.9759 756.5985 770.5845 780.1854 798.3610 799.9095 811.3644 816.0050 843.1399 855.7123 890.5504 909.1639 930.8696 964.0685 978.7056 980.3522 990.9115 997.6239 1015.5228 1017.3217 1023.5166 1034.8265 1042.6105 1066.1864 1084.5142 1103.1660 1110.5610 1113.4194 1135.7141 1138.7144 1142.0269 1154.8408 1174.5617 1181.3245 1190.6751 1202.8708 1215.4353 1225.4955 1246.6739 1249.7056 1278.4829 1287.3161 1321.0532 1330.0443 1341.3252 1344.8469 1352.0398 1356.6368 1372.3922 1379.5445 1397.6104 1400.2898 1416.4674 1434.5279 1442.3150 1456.0142 1462.7898 1463.1666 1473.6470 1476.6961 1478.5254 1482.9800 1485.0771 1486.4672 1491.5685 1590.2425 1605.4938 1614.1315 1639.0646 2962.1793 2980.6349 2993.2150 2995.8908 3002.0093 3008.3171 3011.0918 3012.1065 3065.0072 3069.8599 3077.0383 3083.3141 3089.9137 3091.8900 3092.4424 3103.8180 3107.8065 3114.6428 3123.4552 3130.8063 3143.7900 3158.3105 3170.2021
redmass: 3.2647 3.4718 2.6526 3.6083 3.4279 3.0442 4.6607 5.8004 5.1843 3.1341 4.0146 3.5141 2.8022 3.2572 2.2818 3.8905 1.3065 1.9047 3.5934 3.2358 2.6176 4.6391 3.1599 3.6304 2.1373 2.8448 4.0505 3.3118 3.3536 4.1186 4.3712 2.9802 4.1401 5.9342 3.9717 11.1452 5.9735 1.7538 3.1971 3.5505 3.4955 1.1023 1.0954 2.0054 2.2119 3.0861 1.2692 3.6995 2.3481 1.7771 2.3877 2.5663 1.4226 5.6074 1.3355 1.6945 2.4881 2.4742 2.2299 2.8411 2.8602 1.7557 3.6672 2.2223 2.2867 1.4741 1.5032 2.7595 2.5862 1.0693 2.5234 1.6133 1.1493 2.2122 1.8441 1.1331 1.1331 1.7937 1.4888 1.3165 1.3724 1.5114 1.2645 1.3077 1.3854 1.3871 5.4131 1.2879 1.2633 2.5399 2.1279 1.1279 1.0982 1.0412 1.0404 1.0605 1.0556 1.0717 1.1050 2.0454 1.0698 1.0834 5.9481 7.7199 7.5839 9.9657 1.0712 1.0687 1.0356 1.0358 1.0616 1.0581 1.0582 1.0615 1.1065 1.1065 1.1005 1.1000 1.0984 1.0958 1.0985 1.1027 1.1027 1.0917 1.0847 1.0881 1.0936 1.0963 1.0978
irintensity: 0.2574 0.0423 0.1348 0.0504 0.7629 0.5088 1.2217 2.2490 0.0606 5.1582 0.6068 0.4425 3.6486 7.5222 2.4692 0.5782 0.6813 2.1640 6.6616 0.9204 5.0847 14.4523 4.5593 2.5039 1.9726 0.0777 10.3823 6.5434 1.6984 18.5606 2.4023 0.7071 2.4227 0.5758 6.5447 13.9767 2.7991 53.9328 27.5663 18.4972 10.2797 3.9439 2.8751 5.3385 2.4763 4.3315 0.2232 22.1643 24.0081 7.4501 18.7223 7.1444 0.1815 1.6959 0.7953 16.5198 18.7023 93.8412 20.7512 199.6761 76.3413 18.3016 215.6585 4.0194 28.8038 3.9149 8.8291 44.8630 196.8731 0.9643 41.9011 16.3127 15.6463 2.1151 236.2549 0.0349 0.0259 38.7139 15.2288 2.0675 1.3200 44.1782 1.0483 8.8869 1.0340 5.3522 0.5794 51.1698 26.1634 132.2205 12.3485 5.8192 19.8597 12.2094 11.6338 4.5980 7.6754 14.3136 33.4966 18.9867 11.8494 7.9449 3.9187 86.1448 52.2551 482.4780 43.2314 31.1336 22.1318 19.7435 20.7115 29.5169 20.3187 23.4346 7.9732 6.6984 19.8947 18.6260 37.1494 4.5288 28.2137 49.2911 41.1606 3.0909 1.5641 3.9413 20.8227 36.0890 12.4692
temp: 298.150 k
press: 1.00000 atm
elementType: 8 8 8 8 7 6 6 6 6 6 6 6 6 6 6 6 6 6 6 6 6 6 1 1 1 1 1 1 1 1 1 1 1 1 1 1 1 1 1 1 1 1 1 1 1
symmnumber: 1
zpe: 980118.4 jmol-1
zpe.correction: 0.373307 hartree
zpe.thermalcorrener: 0.395705 hartree
zpe.thermalcorrenthalpy: 0.396649 hartree
zpe.thermalcorrgfe: 0.318812 hartree
zpe.sumelectzpe: -1015.607544 hartree
zpe.sumelectthermal: -1015.585147 hartree
zpe.sumelectthermalent: -1015.584203 hartree
zpe.sumelectthermalfe: -1015.662040 hartree
dipole: 1.8801 1.6548 -3.6860
dipole: 4.4564
quadrupole: -123.2354 -121.8452 -134.2802
quadrupole: -3.1362 8.7292 1.5929
quadrupole: 3.2182 4.6084 -7.8266 -3.1362 8.7292 1.5929
hfenergy: -1015.9808518 hartree
pointgroup: C01 [X(C17H23N1O4)]
dipole: 0.816986 0.4949579 -1.4702177 debye
polarizability: 239.7090031|-16.9011465|178.3545184|6.569621|3.7356915|185.2497774 unknown
InChI: InChI=1S/C17H23NO4/c1-3-21-15(19)17(14-8-6-5-7-9-14)10-12-18(13-11-17)16(20)22-4-2/h5-9H,3-4,10-13H2,1-2H3
charge 0 multiplicity 1
45 atoms
O  1.632796 1.997967 -0.45957
O  1.598909 1.603807 1.827505
O  -4.083736 0.025104 -0.679886
O  -4.072677 -0.651453 1.573126
N  -2.141852 0.214207 0.552497
C  0.774438 -0.166828 0.275567
C  -0.036522 -0.729109 1.488864
C  -0.180204 -0.056631 -0.946812
C  -1.319438 0.082401 1.772204
C  -1.445018 0.767955 -0.624798
C  2.008027 -1.069818 0.002494
C  1.351523 1.218577 0.659484
C  2.974639 -1.255333 1.028018
C  2.205177 -1.730192 -1.235835
C  -3.464394 -0.172729 0.575245
C  4.098039 -2.083603 0.823962
C  3.328998 -2.56348 -1.440372
C  4.279759 -2.746241 -0.412358
C  2.307928 3.309356 -0.196251
C  -5.518945 -0.36827 -0.729672
C  2.516891 3.976317 -1.551192
C  -5.988279 -0.123973 -2.161112
H  -0.301723 -1.77862 1.261571
H  0.590594 -0.723872 2.396594
H  0.341747 0.404904 -1.802601
H  -0.494645 -1.077439 -1.236354
H  -1.932293 -0.412682 2.542079
H  -1.048031 1.091006 2.14441
H  -1.16028 1.821451 -0.419206
H  -2.13644 0.764313 -1.47904
H  2.856059 -0.736436 1.986541
H  1.489257 -1.600882 -2.052488
H  4.831568 -2.21043 1.628145
H  3.460482 -3.067343 -2.404788
H  5.15079 -3.391477 -0.571991
H  3.257783 3.103725 0.329397
H  1.662925 3.90191 0.47744
H  -5.607007 -1.429063 -0.432764
H  -6.077688 0.238744 0.005694
H  3.020344 4.950644 -1.413498
H  3.146175 3.349717 -2.205775
H  1.552927 4.153375 -2.058381
H  -5.410452 -0.73563 -2.875433
H  -5.87397 0.938203 -2.438364
H  -7.055779 -0.395153 -2.255694
