program: Gaussian 09
title: 000177349
version: EM64L-G09RevD.01
frameworkgroup: C1[X(C16H22O3)]
method: RPBEPBE
basis: SDD
operation: Freq
keyword: #pfreq=noraman
keyword: PBEPBE/SDD
title: #p freq=noraman PBEPBE/SDD
converged: YES YES NO NO
title: Mulliken charges:
elementType: O O O C C C C C C C C C C C C C C C C H H H H H H H H H H H H H H H H H H H H H H
charge: -0.235551 -0.428956 -0.189094 -0.374621 -0.373908 -0.373893 -0.380680 -0.374290 -0.456702 -0.513351 -0.034898 0.097384 -0.597665 -0.112402 -0.024892 -0.353779 0.023376 -0.296077 0.168449 0.187282 0.199059 0.188985 0.199304 0.188061 0.222106 0.193293 0.213759 0.215651 0.203937 0.197678 0.206296 0.242182 0.234252 0.211516 0.213628 0.217637 0.225225 0.225406 0.229910 0.230303 0.386080
chargesum: 0.00000
title: Mulliken charges with hydrogens summed into heavy atoms:
elementType: O O O C C C C C C C C C C C C C C C C
charge: -0.235551 -0.042876 -0.189094 0.011720 0.014381 0.036274 0.026373 0.045298 -0.052728 -0.036918 0.176618 0.097384 -0.166400 -0.112402 -0.024892 0.096852 0.023376 0.164136 0.168449
polarizability: 2.65782268e+02 4.41735086e+01 1.96838376e+02 2.64746150e+01 8.09994421e+00 1.39232808e+02
1716.lowfreq: -4.8598 -2.4198 -0.8310 -0.0010 -0.0009 0.0006 6.1818 11.0132 18.8794
frequency: -3.6127 10.9379 18.8648 26.3572 30.1435 44.0388 58.2852 69.8389 78.6105 82.8371 87.3779 103.7701 114.8113 135.2978 139.0377 163.9703 181.6575 199.9604 226.9828 265.7806 283.2559 305.2202 325.0863 374.7271 385.4626 433.3377 442.0959 470.5948 485.7636 499.5094 501.6839 546.7629 590.3901 624.5017 634.7930 637.7220 722.0461 738.3536 780.2545 832.4340 850.7039 870.1972 906.6476 915.0276 918.7944 940.2007 969.7793 971.6831 995.0199 1002.5463 1007.9460 1009.7196 1018.0841 1028.1786 1051.3649 1069.2883 1073.2861 1075.8120 1081.4053 1110.8877 1173.1148 1188.9372 1191.9915 1198.0646 1215.0918 1232.0799 1250.2582 1257.8233 1269.6423 1273.6605 1278.5385 1289.2812 1292.1214 1297.6751 1307.5802 1321.1007 1336.9647 1345.8287 1354.3685 1361.8869 1400.8338 1425.3502 1445.6658 1448.5940 1458.0208 1460.1409 1462.3096 1463.2880 1465.6749 1477.1488 1485.9502 1658.0324 1704.2588 2183.7198 2304.0116 2906.5989 2928.3224 2946.3529 2950.4252 2952.1403 2954.0023 2960.5749 2962.6384 2966.9476 2971.7708 2978.8157 2989.0749 3002.2857 3010.9055 3014.2923 3025.8255 3042.5402 3051.9684 3070.4390 3089.3927 3192.7250 3524.0698
redmass: 6.3554 5.5018 6.2935 3.9474 2.3370 3.5823 3.1584 3.2421 3.7123 3.1151 2.2422 3.1920 3.1929 2.5455 2.0507 4.0634 2.8727 3.3309 4.6255 4.7422 4.3271 2.7836 4.8735 6.4680 3.3308 2.7581 2.6182 5.1866 6.6559 6.3974 1.7836 4.1956 5.3806 1.4774 3.1805 1.6554 1.0672 1.1339 1.2886 1.6049 3.2478 1.8763 7.0495 2.3039 1.8528 1.3369 1.5700 1.6634 2.9818 1.1512 3.5152 1.8900 3.6284 1.8906 2.1393 2.6791 3.5075 2.4838 2.4347 1.4996 1.6263 1.0661 1.3299 1.0939 1.4186 1.3123 1.5770 1.2836 1.3704 1.7313 1.0960 1.1221 1.2334 1.1242 1.2859 1.4748 1.4177 1.7710 1.6289 1.6369 1.6390 1.1795 1.1022 1.0919 1.0917 1.0751 1.0760 1.0632 1.0942 1.1000 1.1008 4.7464 9.3126 11.8028 11.8833 1.0539 1.0548 1.1039 1.0600 1.0611 1.0595 1.0604 1.0595 1.0615 1.1026 1.0625 1.0949 1.0971 1.0983 1.0984 1.1023 1.1034 1.1042 1.0792 1.0742 1.1144 1.0642
irintensity: 1.4320 2.1178 0.2798 1.4308 0.2643 0.9447 2.6339 17.9412 0.0460 0.0827 0.0490 0.3503 0.8901 0.4652 0.0493 0.1825 0.1204 1.1489 0.3214 2.1723 1.4110 0.4172 1.8651 4.2804 2.6967 1.2669 1.1594 21.2145 0.7655 2.9207 32.4932 4.6186 15.9618 142.2100 4.9158 15.8909 11.4277 0.9310 2.6560 6.9794 3.6775 3.7148 20.6636 1.2033 1.3081 82.2824 2.0226 0.5894 24.4261 11.9887 7.1405 0.0984 575.7547 57.6144 5.4564 2.7628 6.1893 1.1428 2.7005 0.7952 7.9558 0.0789 2.0635 6.6817 4.0176 2.0264 38.3268 0.3072 3.2632 10.5119 0.2397 0.7447 0.4285 0.5114 0.5510 19.3271 21.6298 16.4119 0.1049 7.3457 85.1705 3.7093 13.9395 12.0285 2.7234 0.6147 8.9086 0.5051 4.2182 0.2278 23.8046 21.4002 201.2525 2.7236 77.5706 46.1454 78.3323 42.3901 5.9253 10.8984 5.3364 8.2619 25.6043 102.1061 24.3023 73.0688 9.9844 1.9682 8.9454 18.2807 2.1350 33.7528 157.7765 48.3337 7.6332 33.8673 30.2312
temp: 298.150 k
press: 1.00000 atm
elementType: 8 8 8 6 6 6 6 6 6 6 6 6 6 6 6 6 6 6 6 1 1 1 1 1 1 1 1 1 1 1 1 1 1 1 1 1 1 1 1 1 1
symmnumber: 1
zpe: 886972.6 jmol-1
zpe.correction: 0.337830 hartree
zpe.thermalcorrener: 0.360166 hartree
zpe.thermalcorrenthalpy: 0.361111 hartree
zpe.thermalcorrgfe: 0.280240 hartree
zpe.sumelectzpe: -846.958175 hartree
zpe.sumelectthermal: -846.935839 hartree
zpe.sumelectthermalent: -846.934895 hartree
zpe.sumelectthermalfe: -847.015766 hartree
dipole: -0.1719 0.8072 -2.6089
dipole: 2.7363
quadrupole: -92.0452 -105.5055 -116.5009
quadrupole: 17.5517 14.8238 1.9355
quadrupole: 12.6387 -0.8216 -11.8171 17.5517 14.8238 1.9355
hfenergy: -847.2960054 hartree
pointgroup: C01 [X(C16H22O3)]
dipole: 0.0816333 -0.0812065 -1.0703829 debye
polarizability: 261.6204118|51.6970414|201.9959993|-15.1398078|4.809498|138.2370407 unknown
InChI: InChI=1S/C16H22O3/c1-2-3-4-5-6-7-8-9-10-11-12-13-14-19-15-16(17)18/h2,17H,1,3-9,14-15H2
charge 0 multiplicity 1
41 atoms
O  4.759039 0.754173 -0.013952
O  7.571324 2.869972 0.926793
O  6.021516 1.75791 2.26712
C  -4.096618 -1.222697 0.435451
C  -4.718404 -0.011036 -0.294462
C  -2.930135 -1.867859 -0.346361
C  -5.88989 0.630193 0.482725
C  -2.311995 -3.075091 0.390143
C  -6.509463 1.846669 -0.256484
C  -1.146668 -3.750492 -0.393769
C  -7.70196 2.429823 0.471866
C  0.012062 -2.87073 -0.603867
C  -7.81385 3.711702 0.903023
C  0.991881 -2.12366 -0.760667
C  2.074619 -1.299636 -0.936436
C  4.20579 0.31368 -1.318221
C  3.054629 -0.5555 -1.093208
C  5.913171 1.613744 -0.21901
C  6.448839 2.044726 1.13789
H  -4.88422 -1.983852 0.618483
H  -3.735127 -0.90227 1.434648
H  -5.074136 -0.328738 -1.297207
H  -3.932804 0.752761 -0.471152
H  -3.291085 -2.191793 -1.345202
H  -2.142763 -1.10924 -0.527973
H  -6.677636 -0.132473 0.656161
H  -5.542387 0.95397 1.484076
H  -1.941104 -2.756277 1.383436
H  -3.091284 -3.843404 0.567615
H  -6.822477 1.514752 -1.269855
H  -5.737683 2.627734 -0.401243
H  -0.8155 -4.658995 0.148774
H  -1.523999 -4.094175 -1.379051
H  -8.53181 1.729522 0.662618
H  -8.706306 4.066936 1.430875
H  -7.012321 4.443341 0.739586
H  3.903697 1.20452 -1.915026
H  4.990299 -0.231789 -1.891058
H  5.657354 2.529065 -0.798215
H  6.731028 1.094348 -0.766678
H  7.934278 3.161365 1.806413
