program: Gaussian 09
title: 000177273
version: EM64L-G09RevD.01
frameworkgroup: C1[X(C10H12FN5O3)]
method: RPBEPBE
basis: SDD
operation: Freq
keyword: #p
keyword: freq=noraman
keyword: PBEPBE/SDD
title: #p freq=noraman PBEPBE/SDD
converged: YES YES NO NO
title: Mulliken charges:
elementType: F O O O N N N N N C C C C C C C C C C H H H H H H H H H H H H
charge: -0.215030 -0.290974 -0.438248 -0.435111 -0.175782 -0.086718 -0.050373 -0.061902 -0.609458 -0.052725 -0.195695 -0.086491 -0.069276 -0.341743 0.154913 -0.183808 -0.097765 0.167934 -0.361676 0.286467 0.256731 0.258112 0.281586 0.208305 0.217012 0.285500 0.352292 0.359676 0.244978 0.345224 0.334046
chargesum: 0.00000
title: Mulliken charges with hydrogens summed into heavy atoms:
elementType: F O O O N N N N N C C C C C C C C C C
charge: -0.215030 -0.290974 -0.085957 -0.075435 -0.175782 -0.086718 -0.050373 -0.061902 0.069812 0.233742 0.061036 0.171620 0.212310 0.083574 0.154913 0.101692 -0.097765 0.167934 -0.116698
polarizability: 2.11233350e+02 2.11690803e+00 1.47355406e+02 5.56858992e+00 -1.43500303e+01 9.69566949e+01
1716.lowfreq: -10.1793 -6.2333 -0.0004 -0.0004 0.0006 6.4914 23.4973 34.4692 58.5867
frequency: 23.3786 34.3881 58.5489 65.2764 101.4927 127.4616 145.3007 159.5532 194.9852 215.3523 231.6377 264.9496 274.5113 291.2061 323.6520 335.4371 370.1457 402.2918 456.3083 475.8252 509.3037 516.9320 529.9171 546.5668 550.4229 566.0150 625.1613 645.8843 665.8875 691.5277 691.8398 763.9067 794.1372 796.3550 809.1638 829.6303 852.3170 875.2700 929.2022 929.9929 960.6495 963.8330 973.7269 980.6261 1009.9561 1034.8575 1042.6912 1059.3961 1088.3860 1127.7029 1173.7880 1185.3465 1197.5090 1205.1492 1227.5396 1250.7525 1260.1484 1276.9965 1288.6896 1296.9885 1305.8711 1313.0465 1323.9634 1338.2456 1360.5913 1370.8501 1384.4746 1386.8747 1396.8064 1433.1065 1464.0391 1466.6339 1547.7930 1579.4403 1633.7257 2965.3458 2995.7132 3013.1564 3050.0157 3072.7585 3084.4517 3168.4997 3263.6209 3540.0837 3544.2532 3565.8180 3695.1310
redmass: 6.5315 6.5534 6.2609 7.2292 3.8371 4.5255 7.0707 6.1247 7.4963 5.9641 7.3314 3.8830 4.5400 3.8081 1.3686 4.7566 4.1000 4.8289 1.1808 4.9761 8.6992 1.2364 3.6062 1.0484 4.2390 3.9507 8.0738 4.5386 8.9587 5.0663 6.7798 6.6753 5.1823 5.7027 3.5042 1.7468 8.1165 4.0679 1.6553 2.6254 2.4867 5.1943 2.6530 2.9664 3.3877 4.1836 3.8709 2.3772 1.9326 4.5244 1.1295 1.9174 1.2943 2.0695 1.9590 1.3199 1.2019 2.3083 1.6622 1.5410 1.3856 3.4976 6.2567 1.2395 2.1559 1.4465 2.0785 1.4868 2.0651 3.1286 1.1355 3.7217 8.3608 1.8584 2.7736 1.0666 1.0843 1.0866 1.0856 1.0971 1.0897 1.0922 1.0992 1.0443 1.0655 1.0666 1.1056
irintensity: 0.6012 0.9872 1.5229 6.2456 2.3899 2.3221 3.3906 3.5455 1.3903 6.3832 4.6791 11.1659 5.9809 13.9535 174.0313 6.1694 4.3651 0.6157 153.2141 9.2395 2.9024 269.8216 4.0809 0.7102 4.5374 1.1243 2.7512 40.5322 7.4306 32.3476 5.4045 28.4577 20.3936 5.4750 16.9704 3.6222 7.9366 83.2381 18.5003 78.0115 11.8656 86.0107 16.1111 83.8440 112.6332 40.4722 12.4254 16.9697 17.9345 16.1818 31.6084 3.1332 36.2513 14.3030 76.0779 24.5815 10.5936 124.9460 29.9683 3.6759 10.2122 33.4992 4.3315 19.7634 78.2468 10.5950 8.2845 22.9070 9.4547 107.2522 2.4321 55.5626 69.0421 35.1415 607.8218 39.8252 5.9733 27.4289 6.3276 39.6437 17.2500 16.1876 2.1286 128.5782 11.2012 11.0045 50.5578
temp: 298.150 k
press: 1.00000 atm
elementType: 9 8 8 8 7 7 7 7 7 6 6 6 6 6 6 6 6 6 6 1 1 1 1 1 1 1 1 1 1 1 1
symmnumber: 1
zpe: 607345.1 jmol-1
zpe.correction: 0.231326 hartree
zpe.thermalcorrener: 0.248167 hartree
zpe.thermalcorrenthalpy: 0.249111 hartree
zpe.thermalcorrgfe: 0.185549 hartree
zpe.sumelectzpe: -986.106222 hartree
zpe.sumelectthermal: -986.089380 hartree
zpe.sumelectthermalent: -986.088436 hartree
zpe.sumelectthermalfe: -986.151998 hartree
dipole: 0.8706 1.7705 3.5016
dipole: 4.0192
quadrupole: -98.3277 -109.4919 -115.4629
quadrupole: 20.0151 10.1493 4.6896
quadrupole: 9.4331 -1.7310 -7.7021 20.0151 10.1493 4.6896
hfenergy: -986.3375474 hartree
pointgroup: C01 [X(C10H12F1N5O3)]
dipole: 0.3057714 -0.8086564 -1.3240006 debye
polarizability: 210.8929061|-3.9168499|144.8711882|-7.7035726|-17.9916738|99.781357 unknown
InChI: InChI=1S/C10H12FN5O3/c11-5-7(18)4(1-17)19-10(5)16-3-15-6-8(12)13-2-14-9(6)16/h2-5,7,10,17-18H,1,12H2
charge 0 multiplicity 1
31 atoms
F  1.8019 0.158837 -2.132719
O  1.845043 0.350149 0.848538
O  3.3752 -2.401673 0.037489
O  3.896461 2.226617 1.291332
N  -0.295725 0.152272 -0.192906
N  -1.808849 1.760934 -0.813617
N  -1.85287 -1.510416 0.80127
N  -4.193189 -0.761592 0.689828
N  -4.840476 1.303363 -0.260731
C  0.950232 -0.532601 0.071419
C  3.211548 -1.083417 -0.584381
C  1.78486 -0.93905 -1.159803
C  3.26351 -0.038044 0.555997
C  4.006908 1.257363 0.204642
C  -1.558253 -0.329316 0.191902
C  -0.512541 1.413722 -0.78763
C  -2.475118 0.675733 -0.206587
C  -3.850274 0.418948 0.069828
C  -3.198444 -1.641729 1.015464
H  0.700082 -1.442869 0.653451
H  3.967221 -0.896648 -1.372242
H  1.40066 -1.828488 -1.685211
H  3.681808 -0.504612 1.465064
H  3.610052 1.669479 -0.747483
H  5.086997 1.05898 0.092738
H  0.306869 2.014882 -1.168614
H  3.509142 -3.093453 -0.6588
H  2.933199 2.321389 1.511381
H  -3.521704 -2.564305 1.506137
H  -4.604489 2.18305 -0.714947
H  -5.805559 1.069797 -0.03691
