program: Gaussian 09
title: 000177369
version: EM64L-G09RevD.01
frameworkgroup: C1[X(C22H17F2N5OS)]
method: RPBEPBE
basis: SDD
operation: Freq
keyword: #p
keyword: freq=noraman
keyword: PBEPBE/SDD
title: #p freq=noraman PBEPBE/SDD
converged: YES YES NO NO
title: Mulliken charges:
elementType: S F F O N N N N N C C C C C C C C C C C C C C C C C C C C C C H H H H H H H H H H H H H H H H H
charge: 0.332532 -0.210941 -0.196589 -0.472538 -0.115075 -0.184151 -0.048935 -0.117825 -0.012179 0.157678 -0.149950 -0.465379 0.228167 -0.733594 -0.202219 0.258096 -0.304208 0.373282 -0.525099 -0.394699 -0.154401 -0.715051 0.368635 0.341112 -0.291454 -0.347304 -0.362794 -0.381687 -0.376045 0.398788 -0.258510 0.270357 0.263454 0.262199 0.246296 0.239491 0.232562 0.379991 0.275057 0.282888 0.263012 0.293498 0.277693 0.261527 0.231245 0.260980 0.260208 0.261879
chargesum: 0.00000
title: Mulliken charges with hydrogens summed into heavy atoms:
elementType: S F F O N N N N N C C C C C C C C C C C C C C C C C C C C C C
charge: 0.332532 -0.210941 -0.196589 -0.092547 -0.115075 -0.184151 -0.048935 -0.117825 -0.012179 0.157678 0.120407 0.060273 0.228167 -0.015245 -0.202219 0.258096 -0.029151 0.373282 -0.242211 -0.131687 0.139097 -0.437359 0.368635 0.341112 -0.029927 -0.116058 -0.101814 -0.121479 -0.114166 0.398788 -0.258510
polarizability: 3.54649733e+02 5.98081276e+01 2.92183105e+02 2.28098143e+01 -6.64273868e-01 2.28122119e+02
1716.lowfreq: -6.6168 -4.9541 -1.8521 -0.0015 -0.0010 -0.0007 14.8494 23.4827 24.6342
frequency: 14.6881 23.4341 24.6292 33.7569 38.9296 39.7919 48.3065 60.2243 72.4594 92.6936 116.4980 133.0867 146.4746 160.9342 171.6833 176.1647 201.3586 224.1041 225.6756 241.8886 263.6908 267.5021 280.0862 294.5560 310.2782 316.7177 343.3476 353.9129 373.8552 398.3986 401.8013 425.1468 452.1892 459.9260 489.8585 519.9430 521.9359 548.5580 553.6818 560.0922 567.8778 587.5669 602.1723 615.2320 634.8206 642.8393 666.7748 669.7363 680.2888 708.5095 725.0107 728.8937 739.5865 744.9048 757.4714 769.8382 784.5272 802.8240 818.9149 825.8963 843.9813 848.7021 854.6753 866.0909 869.4292 892.7785 915.4197 926.9376 944.8671 954.3364 974.3385 977.5044 992.0333 997.2604 1004.8054 1008.0882 1025.5345 1048.6156 1070.2529 1078.6782 1091.5764 1109.0688 1114.5785 1123.6777 1125.4771 1156.8229 1180.3863 1190.6972 1195.9296 1200.7727 1212.5787 1226.2028 1238.2398 1249.1659 1282.5026 1289.2443 1303.5196 1316.4877 1325.3126 1336.8455 1348.7841 1359.5541 1374.3335 1388.1934 1390.7432 1411.9510 1417.8939 1426.5845 1434.6898 1458.4175 1470.7698 1475.0816 1479.3737 1489.1931 1497.4260 1533.5510 1560.5318 1594.2367 1620.2188 1622.6860 2177.3084 2996.5558 3046.5759 3050.0799 3090.7132 3099.5979 3107.2386 3122.2192 3144.0900 3155.8857 3166.1013 3168.6020 3177.3888 3186.9031 3194.3565 3244.8348 3252.7748 3265.6793
redmass: 9.3255 6.5875 7.3659 6.3641 6.5223 5.4443 6.4485 9.6977 7.2229 5.9488 4.7673 5.5839 8.0516 6.3425 7.0269 5.1196 5.5194 4.1875 2.4913 3.6879 9.1203 3.3606 6.4588 3.9219 7.9392 6.1241 4.7791 4.3917 5.6826 2.7468 2.8447 5.7410 5.4745 3.2522 6.9645 6.7411 7.5396 7.0766 4.9195 5.7948 4.0794 6.0191 5.6104 3.6867 4.6609 6.7842 3.8587 3.4988 3.0715 5.6215 3.7976 2.8205 2.5091 5.0683 3.7524 1.5634 1.8445 4.8655 1.4795 1.3957 1.3970 1.3462 1.6022 3.2772 1.5978 5.8605 5.9580 4.4755 3.2639 5.3557 1.4574 1.3888 1.3878 2.5069 2.1812 3.2026 2.4109 3.1494 2.3748 2.9383 2.1667 2.3384 1.7807 1.6917 1.6289 1.7875 1.5398 1.7618 2.8414 1.5746 1.9105 4.7776 3.1453 1.5069 1.7150 3.0448 2.3674 1.5403 1.7276 1.7040 1.3803 5.6228 7.2579 1.4467 1.9735 4.1445 3.5808 2.2699 1.4336 1.2391 2.7058 1.2499 3.1244 1.0505 4.5004 4.6230 7.2371 8.7650 6.1977 7.8770 12.6299 1.0349 1.0606 1.0831 1.0984 1.0703 1.1005 1.1039 1.0883 1.0889 1.0886 1.0968 1.0973 1.0965 1.0941 1.0957 1.0972 1.1020
irintensity: 0.4732 1.2624 0.5355 0.5242 1.3395 0.8814 0.3623 0.7492 0.0487 0.5346 1.3361 3.4184 0.8115 3.1774 2.1108 0.4850 3.7750 1.1554 0.4768 0.4422 1.0926 1.2157 0.0318 3.0659 6.1508 4.1645 0.2203 3.2142 4.5188 2.3006 0.0864 2.1256 0.7070 6.2238 3.1353 5.0074 11.8778 0.4514 13.4431 7.1331 1.7197 3.8545 8.6176 17.6939 20.4097 3.4369 16.3214 14.7190 13.0384 14.2620 16.6413 36.7077 10.0249 5.4873 4.2007 24.7254 124.1552 10.2879 43.3469 5.0526 15.1927 10.6899 60.2495 25.9080 48.7703 5.8909 10.8324 57.4836 5.4270 22.7616 2.6803 0.4081 1.0283 13.4850 59.2147 7.7825 21.6953 12.6120 33.7250 21.5379 32.9216 16.1929 29.9963 12.4351 8.1683 4.6765 20.5469 4.5942 1.9655 6.3239 0.8964 43.5414 34.5476 7.0581 10.8204 22.2346 9.4906 4.0971 4.8541 30.5531 17.1329 4.9136 9.2768 14.9735 4.1560 13.8890 17.5151 58.1929 33.2372 29.3656 15.4215 20.0142 86.7130 16.6233 16.0799 9.9177 0.2680 37.8182 33.6325 81.7614 49.5337 24.0619 17.2820 1.6971 0.5742 678.5023 9.1464 9.3423 6.3816 2.8317 0.0738 6.8382 1.2955 2.1542 1.5034 5.2017 1.3287 2.3760
temp: 298.150 k
press: 1.00000 atm
elementType: 16 9 9 8 7 7 7 7 7 6 6 6 6 6 6 6 6 6 6 6 6 6 6 6 6 6 6 6 6 6 6 1 1 1 1 1 1 1 1 1 1 1 1 1 1 1 1 1
symmnumber: 1
zpe: 914069.5 jmol-1
zpe.correction: 0.348151 hartree
zpe.thermalcorrener: 0.375371 hartree
zpe.thermalcorrenthalpy: 0.376316 hartree
zpe.thermalcorrgfe: 0.287079 hartree
zpe.sumelectzpe: -1793.059487 hartree
zpe.sumelectthermal: -1793.032267 hartree
zpe.sumelectthermalent: -1793.031322 hartree
zpe.sumelectthermalfe: -1793.120559 hartree
dipole: 1.1924 -6.8301 -2.4858
dipole: 7.3656
quadrupole: -234.5794 -197.1008 -183.4693
quadrupole: -14.5685 3.3768 -1.7917
quadrupole: -29.5296 7.9491 21.5805 -14.5685 3.3768 -1.7917
hfenergy: -1793.407638 hartree
pointgroup: C01 [X(C22H17F2N5O1S1)]
dipole: -0.5243844 1.2333381 -2.5693096 debye
polarizability: 352.1603118|27.815678|262.4485224|-58.9226493|-33.280522|260.3461217 unknown
InChI: InChI=1S/C22H17F2N5OS/c1-14(21-28-20(10-31-21)16-4-2-15(9-25)3-5-16)22(30,11-29-13-26-12-27-29)18-7-6-17(23)8-19(18)24/h2-8,10,12-14,30H,11H2,1H3
charge 0 multiplicity 1
48 atoms
S  -0.664234 2.057147 -2.846556
F  3.465729 1.651566 -1.539048
F  2.640443 3.622223 2.771043
O  0.856946 -1.682024 -0.415269
N  3.743119 -1.851479 0.048272
N  -1.107596 -0.081962 -1.354102
N  4.920746 -1.215765 0.473969
N  4.239105 -2.825581 2.005632
N  -7.656977 -1.667452 2.480198
C  1.771831 -0.68787 -0.975833
C  1.193489 -0.157294 -2.354752
C  3.108135 -1.450063 -1.207504
C  1.987041 0.481443 0.010829
C  1.069821 -1.274024 -3.43014
C  -0.160205 0.464702 -2.104991
C  2.81491 1.587921 -0.278852
C  1.399471 0.461314 1.298844
C  -2.291756 0.683158 -1.282427
C  3.053485 2.649268 0.603705
C  1.602112 1.500618 2.232046
C  3.358747 -2.798313 0.97446
C  -2.239062 1.857851 -2.026257
C  2.424766 2.575897 1.858208
C  -3.431483 0.198546 -0.477692
C  5.167078 -1.847683 1.65557
C  -4.515086 1.054625 -0.136686
C  -3.461835 -1.150362 -0.027979
C  -5.599527 0.57964 0.61886
C  -4.541458 -1.63408 0.730995
C  -5.624723 -0.773257 1.060821
C  -6.734104 -1.262146 1.835814
H  1.875896 0.623498 -2.731834
H  3.829547 -0.812973 -1.741598
H  2.8904 -2.351384 -1.802493
H  0.527908 -2.145617 -3.025958
H  2.065914 -1.600943 -3.774338
H  0.521121 -0.897959 -4.311044
H  -0.081275 -1.312623 -0.533137
H  0.78888 -0.405262 1.566278
H  3.707652 3.481144 0.333178
H  1.147847 1.474907 3.225718
H  2.461328 -3.399894 0.871801
H  -3.013346 2.607668 -2.169412
H  6.030965 -1.5970 2.265065
H  -4.505058 2.104785 -0.446507
H  -2.635077 -1.816702 -0.289246
H  -6.426665 1.247152 0.878984
H  -4.556067 -2.674558 1.069465
