program: Gaussian 09
title: 000177210
version: EM64L-G09RevD.01
frameworkgroup: C1[X(C6H6N4O)]
method: RPBEPBE
basis: SDD
operation: Freq
keyword: #pfreq=noraman
keyword: PBEPBE/SDD
title: #p freq=noraman PBEPBE/SDD
converged: NO NO NO NO
title: Mulliken charges:
elementType: O N N N N C C C C C C H H H H H H
charge: -0.208488 -0.412257 -0.390255 0.054978 0.014993 0.374088 -0.384633 -0.094913 -0.274111 0.016854 -0.237524 0.232814 0.232773 0.303305 0.303133 0.231171 0.238070
chargesum: 0.00000
title: Mulliken charges with hydrogens summed into heavy atoms:
elementType: O N N N N C C C C C C
charge: -0.208488 -0.108951 -0.087122 0.054978 0.014993 0.374088 0.080955 -0.094913 -0.042940 0.016854 0.000546
polarizability: 1.33777003e+02 2.04885358e+00 1.10468385e+02 -2.79275396e-03 1.30505209e-03 4.26574243e+01
1716.lowfreq: -87.9011 -8.4849 -0.0004 -0.0003 0.0008 15.4501 18.7472 79.5584 187.8229
frequency: -87.8909 79.4785 187.8180 201.7234 285.9572 345.9918 425.0007 454.5152 482.0497 520.8748 539.8178 542.4829 552.9123 653.9093 661.3696 750.0762 782.6053 817.5854 848.9845 861.3193 885.1909 947.5671 1016.9027 1054.4378 1073.7696 1185.9630 1206.9715 1252.0214 1282.7653 1315.8885 1358.4634 1363.7358 1424.8253 1484.7255 1525.9605 1581.0431 1601.9788 1608.1688 1613.4747 2925.4008 2957.0450 3104.5002 3119.3300 3508.6680 3558.4072
redmass: 2.4308 6.2633 4.4729 4.5582 7.8323 1.2349 3.1985 6.7660 10.3754 7.3944 2.6857 8.7415 1.4747 8.4688 9.3500 3.4952 6.8238 1.5479 6.4955 3.6169 1.4611 6.6275 1.6861 3.7366 3.4617 3.6169 1.0695 5.9230 1.3281 1.9824 1.2768 1.3668 2.6611 1.2333 2.0483 3.3435 6.3884 7.9815 9.6113 1.0565 1.1056 1.0903 1.0927 1.0785 1.0772
irintensity: 0.0065 0.1485 0.2558 11.5509 0.6561 63.1608 3.8430 1.6681 0.9417 1.5263 10.2255 2.8871 179.5880 1.2052 4.6154 13.5797 2.3264 1.1778 5.0612 1.9121 13.0869 17.8100 7.8856 20.7213 77.1171 0.8735 0.0760 7.9466 30.4391 38.2207 8.5495 9.9352 79.0571 59.6279 128.1028 107.4294 297.2802 165.3448 139.8245 99.4958 37.2124 18.8139 24.7089 15.2008 29.1542
temp: 298.150 k
press: 1.00000 atm
elementType: 8 7 7 7 7 6 6 6 6 6 6 1 1 1 1 1 1
symmnumber: 1
zpe: 322702.7 jmol-1
zpe.correction: 0.122911 hartree
zpe.thermalcorrener: 0.130983 hartree
zpe.thermalcorrenthalpy: 0.131927 hartree
zpe.thermalcorrgfe: 0.089743 hartree
zpe.sumelectzpe: -525.643666 hartree
zpe.sumelectthermal: -525.635593 hartree
zpe.sumelectthermalent: -525.634649 hartree
zpe.sumelectthermalfe: -525.676834 hartree
dipole: -6.9703 -9.7834 0.0022
dipole: 12.0125
quadrupole: -62.8836 -60.0954 -64.2963
quadrupole: -8.2736 -0.0092 0.0047
quadrupole: -0.4585 2.3298 -1.8712 -8.2736 -0.0092 0.0047
hfenergy: -525.7665765 hartree
pointgroup: C01 [X(C6H6N4O1)]
dipole: -2.6512771 3.9123699 -0.0008502 debye
dipolederiv: -0.6029797 0.2630406 0.0001046 0.5383671 -1.0580621 -0.0004338 0.0000017 -0.0002292 -0.3497479 -1.0130157 0.4653878 -0.0004405 0.0761453 -0.3978762 -0.0001366 0.0009203 -0.0004672 -0.476149 -1.1197018 -0.0293521 0.0000507 -0.1626766 -0.5981611 -0.0000411 -0.00036 -0.0000039 -0.2296459 0.0112482 0.2024013 -0.0001325 0.3712749 -0.1206306 0.0002113 -0.0008441 -0.0003825 -0.1828171 -0.4090519 -0.0913122 -0.0000157 0.1442163 -0.9011195 -0.000312 0.0001306 -0.0005089 -0.258519 1.1020461 -0.4072428 0.0000357 -0.1124759 1.1162473 0.0001045 -0.0004314 0.0000922 0.1873857 0.4537096 0.0639542 0.0009853 0.299914 -0.1441666 0.0011376 0.0002566 0.0011357 0.4904439 -0.5036846 0.442891 -0.0004721 -0.0108777 -0.7204279 -0.0003179 0.0004265 -0.0002698 -0.0983814 0.0852968 -0.1613002 0.0000763 -0.0915838 0.3860645 -0.0011413 0.0012561 -0.0003338 -0.1337931 1.0612104 -0.3451422 -0.0000435 -0.4927471 1.5195836 0.0007862 0.0000656 0.0010402 0.2415926 0.9298409 -0.2721263 -0.0000997 -0.4531492 0.6426347 0.0002779 0.0000642 0.0002987 -0.0089748 -0.1112228 0.0134595 -0.0853263 0.0550314 0.0843063 0.0238186 -0.180295 0.0513275 -0.074127 -0.1119016 0.0136799 0.0853296 0.0551998 0.0842614 -0.0239162 0.179284 -0.051475 -0.0725727 0.1580178 -0.0682929 -0.0001473 -0.0437098 0.1096875 -0.0001408 -0.0003134 -0.000024 0.3660584 0.1047218 0.0680283 0.0000232 0.0223626 0.1040039 0.0000148 -0.0000368 -0.0000604 0.3397986 -0.0750386 -0.0875945 0.0001146 -0.0804477 -0.0055265 0.0001682 -0.0000843 -0.000068 0.1237609 0.040505 -0.0704795 -0.0000424 -0.1148435 -0.1008186 -0.0000794 -0.0000406 -0.0000717 0.1356879 unknown
polarizability: 133.6680669|-2.5932753|110.5773211|0.0028226|0.0012392|42.6574243 unknown
InChI: InChI=1S/C6H6N4O/c11-6-4-5(9-3-10-6)8-2-1-7-4/h1,3,8-9H,2H2
charge 0 multiplicity 1
17 atoms
O  1.785987 -2.126938 -0.000981
N  -1.651145 1.311225 0.00027
N  0.674377 1.827186 0.000183
N  -1.047381 -1.46244 0.001291
N  2.393842 0.144661 -0.000196
C  -0.341659 0.871898 0.000033
C  -2.800652 0.373175 -0.002019
C  -0.008606 -0.492258 -0.000002
C  -2.29359 -1.07697 0.000776
C  1.402841 -0.927541 -0.000686
C  2.01473 1.394205 0.000209
H  -3.439273 0.541988 -0.896469
H  -3.443702 0.543653 0.888853
H  -1.851888 2.311441 0.000731
H  0.465033 2.82894 0.000316
H  -3.071441 -1.853229 0.00185
H  2.759127 2.200505 0.000541
