program: Gaussian 09
title: 000177280
version: EM64L-G09RevD.01
frameworkgroup: C1[X(C20H31NO5)]
method: RPBEPBE
basis: SDD
operation: Freq
keyword: #p
keyword: freq=noraman
keyword: PBEPBE/SDD
title: #p freq=noraman PBEPBE/SDD
converged: YES YES NO NO
title: Mulliken charges:
elementType: O O O O O N C C C C C C C C C C C C C C C C C C C C H H H H H H H H H H H H H H H H H H H H H H H H H H H H H H H
charge: -0.279920 -0.465914 -0.306470 -0.254692 -0.262747 -0.104363 -0.083086 -0.159554 -0.558993 -0.536743 -0.039703 -0.270051 -0.229933 -0.080219 -0.207165 -0.496780 0.302436 -0.379582 -0.376305 -0.417810 -0.454521 0.037033 0.251810 -0.719078 -0.626021 -0.607666 0.260954 0.259100 0.258252 0.260744 0.244351 0.219817 0.259503 0.305625 0.242380 0.250151 0.221820 0.349269 0.199762 0.212089 0.206579 0.222128 0.242928 0.217266 0.204833 0.204273 0.235360 0.235924 0.217044 0.255696 0.216178 0.220077 0.272862 0.185605 0.190125 0.228327 0.227014
chargesum: 0.00000
title: Mulliken charges with hydrogens summed into heavy atoms:
elementType: O O O O O N C C C C C C C C C C C C C C C C C C C C
charge: -0.279920 -0.116645 -0.306470 -0.254692 -0.262747 -0.104363 0.177867 0.099546 -0.039998 -0.072576 0.219800 0.035574 0.012447 0.169931 0.014654 -0.084928 0.302436 0.049124 -0.133377 0.004289 -0.014888 0.272957 0.251810 -0.030160 0.052523 0.037801
polarizability: 2.84183854e+02 -3.21640998e+00 2.35278017e+02 -2.23937246e+01 3.45213029e+00 2.03221476e+02
1716.lowfreq: -17.3698 -6.5615 -0.4079 -0.0010 -0.0006 -0.0006 5.9759 12.6945 13.8542
frequency: -14.0510 11.1580 13.5346 30.1662 47.5930 51.6766 59.8661 65.3425 88.8352 95.9472 108.7496 116.6100 146.3830 167.9816 173.8362 188.5159 195.1455 198.9527 209.9418 214.8353 223.5359 231.1736 237.0169 256.2840 270.1261 290.2890 311.8177 321.2743 326.0401 352.2632 361.7416 369.3235 385.0413 405.0582 412.7193 425.3659 435.1906 440.6776 449.5382 481.5649 510.1981 564.2198 569.2458 597.1571 601.8256 686.0169 691.5861 706.6665 731.2936 742.7156 758.3159 797.7600 815.2869 819.4504 834.0864 835.9556 851.4814 861.2674 885.1720 897.7679 904.7342 923.4024 930.2385 949.0035 972.2995 975.7623 980.2494 984.1730 999.4132 1003.7312 1031.9975 1034.4021 1038.9325 1042.5679 1051.8884 1061.6918 1071.0260 1073.5721 1088.3921 1088.6509 1109.4560 1116.6686 1122.2046 1130.2855 1141.8932 1155.2525 1169.3289 1172.1990 1183.2431 1196.9563 1208.8101 1216.5904 1233.8175 1248.3511 1258.1513 1265.3044 1274.7561 1276.9572 1278.0672 1286.2050 1292.1616 1296.1674 1299.1751 1301.1542 1312.8656 1314.3993 1322.9004 1328.1131 1334.0404 1343.9113 1350.3369 1358.9686 1362.6385 1363.8665 1384.9907 1389.6002 1418.1674 1437.0455 1453.6142 1454.9378 1457.9735 1460.8031 1464.5211 1465.6961 1469.1666 1469.5269 1470.7628 1479.6794 1482.7300 1487.3121 1580.5089 1629.4625 1647.7731 1673.4837 2852.2143 2861.6266 2879.8076 2974.1754 2981.3159 2987.2709 2988.4174 2991.2265 3004.2531 3015.6507 3017.5106 3021.7429 3022.4306 3030.0405 3034.7270 3040.0821 3049.1944 3054.8055 3059.6309 3062.7601 3077.8030 3078.4839 3079.2720 3083.9168 3084.7318 3088.3250 3095.1027 3101.9173 3102.1685 3143.6804 3564.9625
redmass: 3.7005 3.8158 3.6106 5.1316 5.0705 3.9369 8.6065 3.8731 4.8348 3.4771 3.7987 3.2684 3.1536 3.1655 3.2843 3.3825 3.8032 3.3721 3.4755 1.3478 1.2541 1.3568 1.7353 3.2231 2.9081 3.5103 2.4118 2.5536 1.3416 3.7702 2.3749 2.6595 2.6129 3.2092 2.7343 2.3317 2.6202 2.7559 3.1572 3.2704 3.2310 2.9489 4.6008 4.1537 3.8146 3.4734 4.7632 3.5775 4.9075 1.9213 2.8072 3.1335 3.1572 3.6298 2.0357 1.9350 2.1798 3.5585 4.4234 3.5379 1.8264 2.2676 2.2716 2.8642 2.0088 1.4582 1.6757 1.8967 2.2502 1.3336 2.2108 2.3179 1.6018 2.4759 1.9336 2.2745 2.8074 2.9276 1.4745 1.7339 1.7053 1.8507 1.6268 1.7380 1.6018 1.5203 1.7216 1.4198 1.5223 1.4843 2.8827 1.4581 1.5785 1.3424 2.2626 1.2955 1.2705 1.2394 1.5918 1.3264 1.2617 1.3462 1.2212 1.3628 1.2564 1.2553 1.3420 1.3587 1.3489 1.6285 1.4035 1.5347 1.5064 1.4360 1.5210 1.2283 1.1408 1.1461 1.0719 1.0988 1.0791 1.0494 1.0639 1.0923 1.0829 1.0581 1.0977 1.0495 1.0464 1.0524 8.8241 9.9287 7.7957 6.6145 1.0568 1.0594 1.0666 1.0598 1.0616 1.0463 1.0824 1.0506 1.0841 1.0623 1.0880 1.0609 1.0727 1.0984 1.0740 1.0988 1.0910 1.1028 1.0850 1.0903 1.0986 1.0958 1.0921 1.0947 1.0987 1.1023 1.0867 1.1004 1.1004 1.0927 1.0665
irintensity: 0.9197 0.1805 0.2938 0.5829 1.0627 0.8669 2.3754 0.1938 0.6354 0.5007 2.0019 0.3539 0.0454 4.7561 2.1338 4.2859 4.0102 0.4259 2.4709 2.0663 0.3730 0.2061 1.0338 3.4642 5.6299 10.9334 7.9961 10.7452 92.2865 9.0639 2.7508 5.3408 5.5525 6.2206 3.2220 2.2006 5.7181 0.7466 1.0665 2.7723 2.2607 0.7462 5.6700 11.5265 9.1902 1.8769 7.4713 4.0714 9.2521 7.9114 9.6622 24.0071 29.8253 16.9961 1.5857 36.8269 19.0975 5.1347 49.2875 9.2434 3.1084 61.3337 23.0486 13.3380 37.4148 38.0138 21.5819 66.4962 5.2301 2.3795 76.2552 9.8802 23.8256 65.9846 65.3085 7.3355 1.2859 13.1051 40.8457 49.5032 77.5095 5.3723 6.6533 47.3104 35.2244 3.3752 85.3112 8.8244 47.1101 32.9728 203.6095 2.2057 5.9406 42.2732 26.1035 13.2136 34.9954 15.2914 10.7868 10.4144 3.4213 0.8509 4.8093 6.8158 5.5894 1.6547 4.1793 23.7228 1.4483 6.0723 3.8395 15.4103 10.4381 3.5431 4.8100 24.5067 6.3700 6.2401 3.8749 3.7950 16.0595 18.9461 6.1848 3.6704 18.5142 20.0166 10.2084 6.4429 12.7336 18.5320 154.9096 190.1591 129.0773 1.8913 68.0309 146.1053 178.9828 28.6086 48.2696 2.2394 4.3967 44.2907 9.1181 27.1472 11.4331 6.7212 35.4410 5.9133 38.3602 21.6644 13.4065 70.2886 1.0082 14.8914 7.7312 7.3270 51.5987 35.8336 44.9641 14.3207 11.2253 10.3732 15.6478 11.0311 8.0275
temp: 298.150 k
press: 1.00000 atm
elementType: 8 8 8 8 8 7 6 6 6 6 6 6 6 6 6 6 6 6 6 6 6 6 6 6 6 6 1 1 1 1 1 1 1 1 1 1 1 1 1 1 1 1 1 1 1 1 1 1 1 1 1 1 1 1 1 1 1
symmnumber: 1
zpe: 1261862.3 jmol-1
zpe.correction: 0.480618 hartree
zpe.thermalcorrener: 0.507883 hartree
zpe.thermalcorrenthalpy: 0.508827 hartree
zpe.thermalcorrgfe: 0.421097 hartree
zpe.sumelectzpe: -1209.512518 hartree
zpe.sumelectthermal: -1209.485253 hartree
zpe.sumelectthermalent: -1209.484309 hartree
zpe.sumelectthermalfe: -1209.572039 hartree
dipole: -1.9272 -1.3686 1.6263
dipole: 2.8691
quadrupole: -148.5750 -164.7453 -151.8626
quadrupole: 14.0416 11.9315 -2.4101
quadrupole: 6.4860 -9.6843 3.1984 14.0416 11.9315 -2.4101
hfenergy: -1209.993136 hartree
pointgroup: C01 [X(C20H31N1O5)]
dipole: -0.6876657 -0.6485472 0.6170081 debye
polarizability: 284.5865815|3.7464533|235.2227863|-21.8355103|1.3920024|202.8739781 unknown
InChI: InChI=1S/C20H31NO5/c1-14-7-5-4-6-8-15-11-16(26-20(24)13-21(2)3)12-17(15)18(22)9-10-19(23)25-14/h6,8-10,14-18,22H,4-5,7,11-13H2,1-3H3
charge 0 multiplicity 1
57 atoms
O  3.206155 -0.778232 0.324443
O  -0.920929 -0.74085 -2.849826
O  -3.491364 0.645543 -0.187102
O  4.845644 0.152198 -1.051715
O  -3.785209 2.924383 0.227107
N  4.302376 2.233128 1.203512
C  0.356299 -0.652384 -0.782602
C  0.257094 -2.175998 -0.39678
C  1.660127 -0.568684 -1.611205
C  1.745927 -2.642514 -0.276134
C  2.621746 -1.510968 -0.864497
C  -0.925665 -0.154139 -1.479399
C  -0.576355 -2.357057 0.848958
C  -0.972684 1.353626 -1.598362
C  -1.872293 -2.766352 0.873672
C  -2.766736 -2.682323 2.098648
C  4.297706 0.048631 0.072564
C  -3.520428 -1.31692 2.150414
C  -1.892159 2.232735 -1.099399
C  -4.57492 -1.134799 1.027252
C  4.702294 0.810082 1.333939
C  -4.753464 0.327742 0.585803
C  -3.120902 1.990688 -0.296048
C  -5.965841 0.566103 -0.323148
C  5.197167 3.009748 0.318791
C  4.090576 2.884763 2.511259
H  0.483101 -0.063005 0.148105
H  -0.228211 -2.693749 -1.246875
H  1.474009 -0.960927 -2.627581
H  2.077323 0.447458 -1.705964
H  2.032538 -2.817967 0.775744
H  1.9110 -3.587517 -0.822563
H  3.469027 -1.849366 -1.484235
H  -1.8012 -0.52134 -0.919239
H  -0.103875 -2.025289 1.78984
H  -0.142817 1.779854 -2.183033
H  -2.335431 -3.095806 -0.069742
H  -1.789134 -0.530362 -3.278146
H  -3.500499 -3.512704 2.108777
H  -2.15261 -2.779726 3.014871
H  -4.008561 -1.200978 3.138582
H  -2.761808 -0.515479 2.068231
H  -1.740992 3.304891 -1.275259
H  -4.290298 -1.717905 0.13074
H  -5.558184 -1.523188 1.357219
H  5.802484 0.685002 1.489862
H  4.174305 0.367298 2.193512
H  -4.784145 1.01696 1.451287
H  -6.897635 0.342867 0.228376
H  -6.008429 1.617472 -0.652491
H  -5.924777 -0.088917 -1.212019
H  4.766189 4.013196 0.153908
H  5.291797 2.502967 -0.654811
H  6.224244 3.135103 0.747087
H  5.021551 2.961855 3.128951
H  3.334249 2.328109 3.092334
H  3.708127 3.908246 2.348587
