program: Gaussian 09
title: 000177110
version: EM64L-G09RevD.01
frameworkgroup: C1[X(C5H11NO4)]
method: RPBEPBE
basis: SDD
operation: Freq
keyword: #p
keyword: freq=noraman
keyword: PBEPBE/SDD
title: #p freq=noraman PBEPBE/SDD
converged: YES YES NO NO
title: Mulliken charges:
elementType: O O O O N C C C C C H H H H H H H H H H H
charge: -0.292987 -0.461853 -0.197323 -0.216242 0.163284 0.049034 -0.393481 -0.686031 -0.221224 -0.321309 0.225361 0.268293 0.246550 0.236225 0.209491 0.229655 0.202474 0.207887 0.189814 0.213471 0.348911
chargesum: 0.00000
title: Mulliken charges with hydrogens summed into heavy atoms:
elementType: O O O O N C C C C C
charge: -0.292987 -0.112942 -0.197323 -0.216242 0.163284 0.274394 0.121362 -0.010660 0.189138 0.081976
polarizability: 8.01693388e+01 -1.14687752e+00 7.62303887e+01 -3.01983923e+00 7.32131475e-01 7.44910791e+01
1716.lowfreq: -3.4467 -0.0006 -0.0002 0.0006 4.0571 14.3538 21.0931 30.8633 51.5685
frequency: 20.1960 30.4512 51.5392 73.0150 112.1758 134.9359 176.4205 200.0026 207.5993 288.6082 338.9104 374.3153 430.3781 473.5670 498.8990 573.9445 670.2261 764.8824 838.2528 863.7131 898.1903 916.4682 942.4160 1038.4585 1041.1503 1052.9423 1078.0357 1104.5383 1146.9893 1183.6242 1213.4432 1235.9847 1242.7316 1262.0950 1280.5325 1320.9027 1338.6268 1381.8272 1388.3307 1411.3080 1419.9130 1440.2654 1456.4922 1461.3975 1466.1703 1476.2626 2946.0124 2960.0839 2982.7848 2988.8082 3011.3603 3023.0139 3037.5161 3085.3675 3097.6292 3127.2149 3591.8804
redmass: 4.3163 10.5532 4.4001 4.1360 1.1440 3.5265 1.6964 3.2279 1.3760 3.5197 2.8032 3.3644 3.1084 2.9748 3.4208 3.8172 6.4406 2.6868 5.5684 2.7719 1.7601 1.9586 1.9756 2.7221 1.7559 3.0297 2.8858 2.1727 1.9142 1.1437 1.3589 4.8332 1.1419 1.1436 1.3489 1.2492 1.6824 1.3190 1.2181 1.5621 1.4082 2.2686 1.0809 1.0804 1.0754 1.0530 1.0566 1.0587 1.0826 1.0378 1.1053 1.1038 1.0603 1.0989 1.1002 1.1036 1.0669
irintensity: 4.4591 0.9748 3.8333 2.2686 156.7084 14.2802 8.0242 5.7187 2.3314 0.2493 2.3393 4.5373 19.3235 13.1098 1.3864 7.6484 13.9667 3.3279 10.6053 35.0680 14.3158 17.0691 14.6347 29.3550 30.7322 34.4788 102.6894 3.4095 31.4972 3.3658 24.4248 71.1086 24.2680 12.0930 6.4284 24.4808 9.3427 5.0273 22.2233 6.4478 82.0733 83.8263 3.1348 9.2384 4.5936 17.5053 15.6715 84.0566 22.1624 15.6854 40.1358 59.1119 6.7455 28.2833 22.2444 4.7071 5.3448
temp: 298.150 k
press: 1.00000 atm
elementType: 8 8 8 8 7 6 6 6 6 6 1 1 1 1 1 1 1 1 1 1 1
symmnumber: 1
zpe: 437670.5 jmol-1
zpe.correction: 0.166700 hartree
zpe.thermalcorrener: 0.178913 hartree
zpe.thermalcorrenthalpy: 0.179857 hartree
zpe.thermalcorrgfe: 0.125738 hartree
zpe.sumelectzpe: -551.837102 hartree
zpe.sumelectthermal: -551.824889 hartree
zpe.sumelectthermalent: -551.823945 hartree
zpe.sumelectthermalfe: -551.878064 hartree
dipole: -2.2350 2.1293 0.0019
dipole: 3.0870
quadrupole: -64.5278 -56.9481 -59.2310
quadrupole: 15.7003 1.2903 0.8585
quadrupole: -4.2922 3.2876 1.0046 15.7003 1.2903 0.8585
hfenergy: -552.0038019 hartree
pointgroup: C01 [X(C5H11N1O4)]
dipole: -0.8569562 0.8137386 -0.280117 debye
dipolederiv: -0.9668763 -0.2768086 0.2541828 -0.2324755 -0.6272851 0.178234 0.2353053 0.1643481 -0.4801158 -0.7341611 0.1019073 -0.0788021 0.1448534 -0.228366 0.1940726 -0.0755437 0.1349609 -0.6328779 -0.3773202 0.2132261 0.1370692 0.3007044 -0.5932485 -0.2251351 0.0237485 -0.0557904 -0.5437905 -0.3538834 0.1237278 -0.0665767 0.1707026 -0.4334039 0.0215802 0.0734167 -0.1684856 -0.7641298 0.4140814 -0.3539614 -0.051224 -0.5035856 0.8125531 0.1491401 -0.0424306 0.1647604 1.1050719 0.6482667 0.1395413 -0.0475527 0.2435036 0.5943441 -0.1565765 -0.002475 -0.018289 0.2140782 0.133112 0.0264653 0.0257238 0.1141817 0.0114099 0.0742724 0.0178524 0.0504885 0.0412091 -0.0833062 0.1270384 -0.0177988 -0.0040002 -0.1241804 0.0961225 0.0023527 0.0697748 0.0403916 0.593881 0.0995397 -0.2278145 -0.059696 0.2443429 -0.1345819 -0.3186314 -0.1951519 0.488627 0.4886211 -0.0927161 0.1615001 -0.1120727 0.2160803 -0.0981097 0.1607974 -0.111283 0.5557355 0.018501 -0.0439267 -0.0119593 -0.0693154 0.0152088 0.0200316 -0.047744 -0.0562305 -0.1061956 0.0874874 0.0381181 -0.045818 0.0425327 0.04373 -0.051855 -0.0312391 -0.0155353 0.0059558 -0.0408826 -0.0696937 0.0073632 -0.0660239 0.0178783 0.0281464 -0.0309795 0.0166425 0.0893428 -0.0815244 0.0898209 0.0601202 0.0743249 0.0784988 -0.0045948 0.0824902 -0.0253249 0.0534999 -0.0137543 -0.1479588 -0.0225199 -0.1314821 -0.0662203 0.0101262 -0.0231627 -0.0063835 0.0796871 0.1062861 0.0049993 -0.0072523 0.0041578 0.0643457 -0.073872 -0.0267293 -0.0007534 -0.1152994 -0.0489595 -0.0058157 -0.0955539 0.0078644 0.0475022 0.0771034 0.0153047 0.0916588 -0.1598357 -0.013364 0.042386 0.0460802 0.0954795 -0.1214887 -0.0611265 0.0710931 0.0170729 0.0329921 -0.081483 -0.058607 0.0917639 -0.0211762 0.0293172 0.089681 0.0553345 0.1189801 -0.174892 0.0049331 0.1178986 -0.0057958 0.111679 -0.0874851 -0.02525 -0.0256422 -0.0878386 -0.0046075 0.300345 -0.0751806 -0.1051353 -0.1101566 0.1064667 -0.1074088 -0.113118 -0.0876211 0.2751532 unknown
polarizability: 80.0639109|-2.1837668|76.6131786|-2.4515595|0.085804|74.213717 unknown
InChI: InChI=1S/C5H11NO4/c1-5(4-6(8)9)10-3-2-7/h5,7H,2-4H2,1H3
charge 0 multiplicity 1
21 atoms
O  -0.686707 0.044095 -0.074075
O  -3.697955 -0.206526 -0.378597
O  2.734092 -1.448682 -0.425306
O  2.181848 -0.355514 1.496675
N  2.193605 -0.476579 0.21576
C  0.270421 1.158874 0.03698
C  1.553145 0.638395 -0.614133
C  -0.250195 2.41674 -0.682361
C  -1.715084 0.037555 0.977592
C  -2.8144 -0.924716 0.553044
H  0.47615 1.37475 1.106219
H  1.354959 0.200352 -1.603946
H  2.317007 1.431917 -0.696983
H  -1.226922 2.71508 -0.264256
H  0.448071 3.265887 -0.561393
H  -0.394507 2.219531 -1.758956
H  -1.257048 -0.289801 1.935278
H  -2.159042 1.045033 1.114975
H  -3.383802 -1.248958 1.44987
H  -2.347106 -1.813689 0.082869
H  -4.176429 -0.851844 -0.954756
