program: Gaussian 09
title: 000177104
version: EM64L-G09RevD.01
frameworkgroup: C1[X(C11H16)]
method: RPBEPBE
basis: SDD
operation: Freq
keyword: #p
keyword: freq=noraman
keyword: PBEPBE/SDD
title: #p freq=noraman PBEPBE/SDD
converged: YES YES NO NO
title: Mulliken charges:
elementType: C C C C C C C C C C C H H H H H H H H H H H H H H H H
charge: -0.540931 0.511577 -0.360461 0.498848 -0.594331 -0.539853 -0.430312 -0.417603 -0.222115 -0.684712 -0.674448 0.199097 0.199876 0.210608 0.211550 0.236055 0.208136 0.207460 0.231854 0.231259 0.219660 0.209978 0.209632 0.219853 0.222552 0.214843 0.221927
chargesum: 0.00000
title: Mulliken charges with hydrogens summed into heavy atoms:
elementType: C C C C C C C C C C C
charge: -0.141957 0.511577 0.061698 0.498848 -0.358276 -0.124257 -0.198458 -0.186345 -0.002455 -0.045250 -0.015125
polarizability: 1.50772460e+02 -2.18195926e+00 1.19070396e+02 3.55839829e+00 1.04333052e+01 8.05015626e+01
1716.lowfreq: -13.5662 -0.0006 -0.0003 0.0003 7.2213 8.2707 29.3701 36.0711 73.1981
frequency: 28.4682 35.4344 73.1310 91.4998 134.7388 206.6297 221.7242 269.9512 277.8465 305.1090 306.2943 395.7501 452.7557 508.7652 572.6325 633.2914 707.1784 726.8991 745.4168 787.1391 804.9734 860.2527 872.1930 906.2292 909.7516 916.9236 978.7569 982.1720 990.4413 1041.5070 1049.3260 1061.9237 1077.8053 1095.0520 1107.9344 1169.1224 1181.1551 1220.9845 1242.9181 1252.2307 1282.9094 1285.1634 1313.7921 1315.2743 1340.1480 1382.7083 1385.7863 1388.2469 1439.2697 1468.5973 1470.5862 1472.9022 1475.4515 1476.3030 1481.4410 1487.9834 1490.6943 1596.6365 1615.9979 2970.7258 2973.2810 2977.6237 2983.8397 2985.3487 3016.4360 3036.1414 3041.5291 3070.4530 3072.4745 3075.8701 3082.5028 3101.1134 3110.9092 3120.3616 3147.2949
redmass: 2.3779 2.2314 1.9403 3.5198 3.3375 1.1832 1.1104 3.0909 2.0260 3.1042 3.0819 2.2232 3.0451 4.3585 4.0969 4.5764 2.5298 2.5924 1.0998 1.1660 1.6370 1.5430 1.5537 2.2198 1.4832 1.4669 1.3508 2.2528 5.5240 1.5465 2.8760 2.0417 1.4497 2.1665 1.4567 1.5332 1.1066 1.3956 1.2673 2.0216 1.2157 1.3806 1.6099 1.2398 1.4824 6.6206 1.1997 1.2142 2.7722 1.1265 1.0454 1.2451 1.0551 1.0503 1.7253 1.0898 1.0987 6.0745 6.3183 1.0452 1.0494 1.0349 1.0602 1.0597 1.1000 1.1017 1.1033 1.1015 1.0991 1.1000 1.1011 1.0908 1.0857 1.0918 1.0991
irintensity: 0.0378 0.0232 0.0065 0.8255 0.5066 0.0787 0.0131 0.4195 0.2641 0.2023 0.5365 0.2054 6.7951 0.8495 1.4571 0.1254 15.8786 20.1633 4.9508 2.3259 36.8913 4.3599 4.0256 5.2118 3.8652 2.5398 0.2706 1.8422 0.2558 3.4585 0.1234 13.9594 0.0649 17.7373 5.8768 2.6306 0.0904 0.0516 0.1695 0.2418 0.5770 0.4089 1.7641 0.0731 1.7925 0.2857 9.4608 10.5951 7.3931 0.2328 12.9650 4.3184 6.8553 8.0374 11.1039 15.5816 13.7487 8.4007 25.5158 12.4761 48.4425 38.9656 55.1966 39.3430 1.0736 8.4662 11.6068 76.5372 47.5206 59.8361 39.7152 24.0412 1.5218 30.7783 29.4185
temp: 298.150 k
press: 1.00000 atm
elementType: 6 6 6 6 6 6 6 6 6 6 6 1 1 1 1 1 1 1 1 1 1 1 1 1 1 1 1
symmnumber: 1
zpe: 622884.2 jmol-1
zpe.correction: 0.237244 hartree
zpe.thermalcorrener: 0.249199 hartree
zpe.thermalcorrenthalpy: 0.250143 hartree
zpe.thermalcorrgfe: 0.197768 hartree
zpe.sumelectzpe: -427.935753 hartree
zpe.sumelectthermal: -427.923798 hartree
zpe.sumelectthermalent: -427.922854 hartree
zpe.sumelectthermalfe: -427.975229 hartree
dipole: -0.1065 -0.4389 0.0901
dipole: 0.4605
quadrupole: -62.8366 -64.9263 -71.0285
quadrupole: -0.8436 0.4971 2.8418
quadrupole: 3.4272 1.3375 -4.7647 -0.8436 0.4971 2.8418
hfenergy: -428.1729969 hartree
pointgroup: C01 [X(C11H16)]
dipole: -0.0442595 0.1722508 -0.0345896 debye
polarizability: 150.646771|2.6626451|119.0677454|-4.2818881|10.4771727|80.6299024 unknown
InChI: InChI=1S/C11H16/c1-3-6-11-8-5-7-10(4-2)9-11/h5,7-9H,3-4,6H2,1-2H3
charge 0 multiplicity 1
27 atoms
C  -2.192819 -0.026397 0.671055
C  -0.75679 -0.440347 0.384467
C  -2.873082 0.65699 -0.549552
C  1.657996 0.117868 0.303806
C  0.315788 0.461698 0.601928
C  2.785927 1.120584 0.508132
C  -0.462228 -1.72377 -0.143078
C  1.923571 -1.172641 -0.222957
C  0.869721 -2.086726 -0.444416
C  -4.32834 1.077556 -0.254929
C  3.101697 1.924029 -0.78287
H  -2.794571 -0.911281 0.958658
H  -2.225172 0.675417 1.528112
H  -2.276122 1.542079 -0.845435
H  -2.84653 -0.037835 -1.411889
H  0.100358 1.454703 1.020696
H  2.51856 1.828588 1.315807
H  3.703397 0.59409 0.835173
H  -1.276913 -2.440087 -0.308429
H  2.957394 -1.462336 -0.450277
H  1.087101 -3.084828 -0.842476
H  -4.947974 0.202331 0.018013
H  -4.372414 1.794339 0.587014
H  -4.79358 1.559995 -1.133991
H  3.398044 1.246993 -1.604554
H  3.926273 2.640632 -0.611919
H  2.215005 2.491054 -1.119985
