program: Gaussian 09
title: 000177107
version: EM64L-G09RevD.01
frameworkgroup: C1[X(C19H20O6)]
method: RPBEPBE
basis: SDD
operation: Freq
keyword: #pfreq=noraman
keyword: PBEPBE/SDD
title: #p freq=noraman PBEPBE/SDD
converged: NO YES NO NO
title: Mulliken charges:
elementType: O O O O O O C C C C C C C C C C C C C C C C C C C H H H H H H H H H H H H H H H H H H H H
charge: -0.249768 -0.183578 -0.210812 -0.198890 -0.166212 -0.205882 0.317514 -0.244082 -0.059056 0.126003 -0.162965 -0.577918 -0.324536 -0.511493 -0.623153 -0.073240 -0.515130 -0.211167 -0.831931 0.153461 0.169062 0.444460 -0.448514 -0.343788 -0.170360 0.317284 0.214707 0.258926 0.252757 0.275271 0.265061 0.226021 0.245531 0.251703 0.274781 0.253701 0.259210 0.225961 0.223170 0.270115 0.229663 0.210955 0.256620 0.329413 0.261126
chargesum: 0.00000
title: Mulliken charges with hydrogens summed into heavy atoms:
elementType: O O O O O O C C C C C C C C C C C C C C C C C C C
charge: -0.249768 -0.183578 -0.210812 -0.198890 -0.166212 -0.205882 0.317514 0.073202 0.155651 0.126003 0.095961 -0.049890 -0.059475 -0.039941 -0.096668 0.180462 -0.029959 0.012003 -0.121198 0.153461 0.169062 0.444460 -0.191894 -0.014375 0.090766
polarizability: 2.48039401e+02 1.91886272e+00 1.89808379e+02 1.57829453e+01 -4.21076958e+00 1.61846925e+02
1716.lowfreq: -11.5905 -5.4035 -0.0010 -0.0007 -0.0005 13.7758 39.6066 45.7461 64.4625
frequency: 39.5769 45.5898 64.4242 84.2885 97.5659 133.6419 146.2826 153.8979 177.5919 194.6844 215.7171 249.9845 261.1544 277.8709 281.7063 317.6937 326.0646 341.5315 354.8874 382.2609 393.7736 416.6129 435.9321 461.8694 482.1395 505.8504 517.8478 557.5487 569.8161 593.7767 610.3763 639.2239 654.1457 666.0180 675.6831 695.7650 720.2792 721.6254 736.3952 742.7412 760.7501 805.9631 818.6990 823.2443 831.5830 837.8590 841.4097 853.0289 856.8916 865.5678 883.1810 903.1417 914.3914 937.5685 952.3410 958.1410 964.3492 975.7666 982.9693 992.7717 1001.1493 1013.8595 1022.4505 1035.2705 1044.5381 1051.3924 1063.1132 1078.6368 1099.6856 1105.4958 1121.5192 1133.5892 1135.6449 1162.0808 1167.0135 1172.2584 1189.2068 1190.2734 1196.0258 1211.1908 1222.0518 1233.9755 1238.2621 1240.3422 1270.9966 1277.1502 1288.9621 1294.7792 1301.3265 1302.8941 1317.4235 1319.6671 1329.0057 1339.1120 1343.9058 1351.9905 1383.8250 1390.8774 1413.4885 1459.6386 1466.0714 1474.0007 1476.7066 1477.5598 1486.7165 1494.8157 1575.3583 1704.3798 1720.9953 2956.4591 2983.7317 2988.4600 2994.4403 2995.4587 3020.1050 3021.8211 3040.6327 3056.1350 3072.4423 3075.2318 3086.3994 3086.9325 3088.3430 3088.5034 3090.6392 3111.0588 3211.6631 3264.4385 3271.7491
redmass: 3.9837 7.7280 6.0106 7.3766 8.4986 9.3177 6.5004 5.4472 4.9315 2.6545 1.3586 3.5993 4.3345 4.1308 5.9451 4.3358 3.5968 4.7108 3.1177 2.8107 3.1241 2.8906 3.7475 3.3372 4.0152 4.3337 3.9870 5.2976 3.9199 4.0879 3.5298 5.6559 5.2139 3.5435 5.7784 6.7431 2.6454 1.6109 4.7756 5.5916 5.0138 4.4880 3.2453 3.8075 2.9863 1.9828 2.3485 1.9108 2.6384 3.6687 2.6197 2.5726 2.5892 2.8760 1.6831 3.0987 2.4155 3.2841 2.4009 2.4698 2.4271 2.6275 2.3900 1.8260 2.4214 2.1363 2.0816 2.6847 2.3960 1.8767 2.8029 2.3213 2.0617 1.4347 1.6856 1.7108 1.8578 1.4807 1.9818 1.3451 1.8336 1.8492 1.7166 1.7050 1.6655 1.6456 1.4197 1.4466 1.5090 1.5341 1.4042 1.3633 1.7090 1.3842 1.3636 1.3828 1.2619 1.2303 2.3850 1.0877 1.0754 1.5739 1.2147 1.7058 1.0715 1.0621 5.8844 12.6175 12.4373 1.0817 1.0795 1.0401 1.0653 1.0804 1.0603 1.0602 1.0614 1.1016 1.0874 1.0984 1.0988 1.0983 1.1008 1.0936 1.0980 1.1042 1.0939 1.0997 1.1076
irintensity: 0.5710 1.3629 2.4697 0.0782 0.3399 3.0172 0.4103 3.3984 2.3212 0.6749 0.1990 3.4551 2.1964 3.4439 3.5516 2.4313 0.9932 2.7373 1.0363 4.2326 3.8480 1.2801 2.1641 2.3016 2.0309 0.6067 0.5403 1.7128 2.8615 11.7172 2.0694 6.4552 1.5044 14.6744 6.3156 7.6488 22.2314 30.5475 9.6166 4.9920 0.5719 10.2447 17.5994 69.5131 14.9973 35.5298 10.2663 14.2280 18.2021 56.0532 29.8278 8.8305 19.1339 11.8176 4.7440 5.4962 6.7755 144.2175 21.5461 42.0391 54.9175 32.4487 35.9599 25.2133 11.7309 8.5631 8.4785 33.3790 17.6532 26.2161 3.8756 51.7072 44.3906 9.0350 8.7058 1.8649 6.1729 2.0344 6.6471 4.6456 4.9357 3.3821 24.0785 33.3577 2.9000 10.5768 13.8272 3.7404 1.4829 1.9565 4.8695 3.0529 17.3017 2.4767 0.5469 3.5523 10.0051 18.6854 1.5138 9.4759 4.0027 25.5083 17.0983 9.9432 4.9721 3.1501 1.7603 259.3674 272.1876 15.2627 5.2141 9.1139 8.6031 57.4676 9.7638 25.9648 14.1989 20.1428 12.8192 22.4027 17.0802 29.0401 37.1542 15.0913 33.1931 12.8825 1.6863 10.8337 13.1573
temp: 298.150 k
press: 1.00000 atm
elementType: 8 8 8 8 8 8 6 6 6 6 6 6 6 6 6 6 6 6 6 6 6 6 6 6 6 1 1 1 1 1 1 1 1 1 1 1 1 1 1 1 1 1 1 1 1
symmnumber: 1
zpe: 942650.0 jmol-1
zpe.correction: 0.359036 hartree
zpe.thermalcorrener: 0.378674 hartree
zpe.thermalcorrenthalpy: 0.379618 hartree
zpe.thermalcorrgfe: 0.311969 hartree
zpe.sumelectzpe: -1185.490475 hartree
zpe.sumelectthermal: -1185.470838 hartree
zpe.sumelectthermalent: -1185.469894 hartree
zpe.sumelectthermalfe: -1185.537543 hartree
dipole: 2.7230 -9.4124 3.4165
dipole: 10.3769
quadrupole: -140.5929 -154.5013 -146.4046
quadrupole: -6.7683 12.7447 8.3181
quadrupole: 6.5734 -7.3350 0.7616 -6.7683 12.7447 8.3181
hfenergy: -1185.8495118 hartree
pointgroup: C01 [X(C19H20O6)]
dipole: 1.1307379 -2.5821468 2.9532117 debye
polarizability: 247.0762275|11.592215|180.6726257|14.1671274|-13.4426677|171.9458527 unknown
InChI: InChI=1S/C19H20O6/c1-18-6-13(9-2-3-22-8-9)25-19(18)7-14(24-17(19)21)15-11-4-10(5-12(15)18)23-16(11)20/h2-3,8,10-15H,4-7H2,1H3
charge 0 multiplicity 1
45 atoms
O  -1.948945 0.50079 1.388459
O  0.951195 2.183536 -0.053396
O  3.495206 -0.705522 -1.840981
O  -1.04894 1.747784 -1.153163
O  3.665318 1.619456 -1.975257
O  -5.122289 0.233098 -1.68807
C  0.01029 -0.79825 0.82053
C  1.39235 -0.665362 0.114938
C  2.308492 0.315862 0.930372
C  -0.538598 0.658183 1.087823
C  1.569348 1.650245 1.219638
C  0.321412 1.414485 2.115657
C  3.715582 0.437986 0.258486
C  2.125996 -1.993779 -0.197744
C  -1.175179 -1.33192 -0.03363
C  3.556032 -1.707738 -0.710014
C  4.396368 -0.952214 0.34752
C  -2.428381 -0.781897 0.713944
C  0.092978 -1.606704 2.144545
C  -0.308315 1.555647 -0.17933
C  3.618345 0.603107 -1.274427
C  -3.655521 -0.546922 -0.118948
C  -4.930828 -1.22321 0.054372
C  -3.814763 0.326697 -1.186177
C  -5.789305 -0.732805 -0.910898
H  1.209714 -0.190168 -0.870238
H  2.508603 -0.127846 1.929237
H  2.249571 2.440319 1.572375
H  0.536556 0.837486 3.027444
H  -0.143071 2.375309 2.396205
H  4.296654 1.267879 0.691182
H  2.207257 -2.637552 0.69956
H  1.559449 -2.557766 -0.960997
H  -1.205355 -2.432631 -0.094434
H  -1.143036 -0.926316 -1.060224
H  4.039457 -2.601781 -1.131845
H  5.455717 -0.904654 0.040667
H  4.334399 -1.409693 1.349777
H  -2.697923 -1.461228 1.545778
H  -0.784663 -1.410316 2.783613
H  0.116842 -2.689477 1.925338
H  0.992694 -1.372415 2.740052
H  -5.167777 -1.974511 0.806601
H  -3.160281 1.057596 -1.65103
H  -6.823255 -0.923786 -1.181512
