program: Gaussian 09
title: 000177093
version: EM64L-G09RevD.01
frameworkgroup: C1[X(C15H26Br2O2)]
method: RPBEPBE
basis: SDD
operation: Freq
keyword: #p
keyword: freq=noraman
keyword: PBEPBE/SDD
title: #p freq=noraman PBEPBE/SDD
converged: YES YES NO NO
title: Mulliken charges:
elementType: Br Br O O C C C C C C C C C C C C C C C H H H H H H H H H H H H H H H H H H H H H H H H H H
charge: -0.026847 -0.063323 -0.253633 -0.310301 0.033664 -0.051247 -0.055912 -0.514743 -0.512261 -0.555999 0.112746 -0.432047 -0.512210 -0.357682 -0.352487 -0.355950 -0.359399 -0.674634 -0.697184 0.226634 0.236095 0.249423 0.255222 0.254265 0.313362 0.224552 0.260823 0.275766 0.199530 0.208055 0.271766 0.186919 0.234973 0.265052 0.210748 0.189732 0.183253 0.196443 0.201348 0.217772 0.204602 0.238341 0.209650 0.216715 0.208408
chargesum: 0.00000
title: Mulliken charges with hydrogens summed into heavy atoms:
elementType: Br Br O O C C C C C C C C C C C C C C C
charge: -0.026847 -0.063323 -0.253633 -0.310301 0.260297 0.184848 0.193510 -0.005255 -0.198899 -0.070624 0.388512 -0.024462 -0.240444 0.064209 0.123313 0.017035 0.038391 -0.013918 -0.062412
polarizability: 2.30172241e+02 8.58419618e+00 1.89723893e+02 -1.43119007e+01 1.43215315e+00 1.77558740e+02
1716.lowfreq: -0.0006 -0.0005 0.0003 3.6703 6.9178 7.7545 25.7875 27.5343 37.7307
frequency: 25.7605 27.4575 37.6871 47.0292 59.5816 73.1042 82.0040 94.7931 106.1132 128.8712 133.2506 152.9953 178.1011 183.4687 199.1716 221.7233 239.0690 245.6244 259.0755 269.1831 302.4789 330.3418 337.5737 373.6826 406.4876 429.3858 435.1969 516.4633 522.8348 558.0578 580.8283 595.9631 626.5007 648.9888 710.6214 725.7412 750.0184 777.0379 786.9896 796.7889 825.6604 829.6130 864.5116 868.4747 889.8567 891.6840 907.4541 937.4057 957.1062 963.9401 978.1207 995.0706 1006.9895 1020.7323 1037.4311 1045.3038 1049.0456 1064.6057 1078.1855 1079.1119 1112.5146 1122.4767 1124.2408 1148.9193 1158.9090 1182.2676 1191.7294 1195.3713 1202.4192 1217.4185 1225.9317 1234.6908 1249.7225 1255.4290 1263.0599 1265.1530 1273.7413 1281.7103 1282.5042 1291.3061 1299.2001 1303.9766 1307.7178 1323.8029 1334.1234 1353.1703 1354.4242 1362.9186 1373.8696 1388.7800 1393.7754 1446.1944 1449.5684 1452.1953 1464.4295 1466.4965 1470.5841 1476.2406 1478.1566 1481.2455 1484.6214 1489.0390 1521.0988 2939.3327 2949.9568 2965.9540 2968.6631 2969.3476 2971.5332 2973.0869 2980.9604 2993.3377 2997.6044 3005.9743 3021.9971 3028.5001 3035.8031 3038.8776 3046.5042 3056.2254 3061.3737 3063.1127 3068.5888 3070.9976 3076.9517 3082.0066 3091.6298 3104.8099 3114.3972
redmass: 5.9525 4.2323 6.3125 6.0151 1.7242 3.0295 3.2133 3.1949 4.9824 2.3985 2.1122 4.3145 2.2345 2.8785 3.3967 2.2515 1.1174 2.1683 4.8100 4.3349 3.8349 3.2188 2.8525 2.9679 4.1768 3.5102 3.8308 3.2381 3.7165 3.4874 4.2816 3.2510 2.9099 4.4319 3.3052 1.0795 1.3145 1.8642 2.5775 2.0427 3.7188 2.1567 2.0793 2.2639 2.3645 2.9928 5.7576 3.6516 1.7197 2.4113 1.9774 2.1671 3.4634 2.7421 1.7479 2.1038 2.3751 2.0012 1.9357 2.1321 1.8570 1.9022 1.4195 2.0248 1.2304 1.1554 1.3591 1.3682 1.5431 1.2637 1.4437 1.2602 1.3650 1.2916 1.2578 1.2860 1.3240 1.2472 1.8691 1.0601 1.1254 1.2310 1.2593 1.2715 1.2952 1.5455 1.5287 1.3754 1.6179 1.2182 1.2101 1.0844 1.0760 1.0965 1.0675 1.0783 1.0729 1.0429 1.0424 1.0714 1.0513 1.0903 1.0772 1.0780 1.0588 1.0618 1.0577 1.0664 1.0381 1.0641 1.0384 1.0959 1.0626 1.0884 1.0981 1.0989 1.0599 1.0855 1.0870 1.1016 1.0946 1.0939 1.1008 1.0992 1.0924 1.0956 1.0996 1.0927 1.1033
irintensity: 0.1926 0.1175 0.7965 0.7627 0.0129 0.2238 0.1768 0.0908 0.1444 0.0447 0.0342 0.9076 0.1689 1.5469 2.0122 1.5946 0.0376 1.2507 1.8821 4.7019 5.1632 7.5427 3.0629 2.2905 3.2705 0.5913 4.1297 11.6060 15.1505 6.4033 32.8512 3.3186 4.6135 31.7063 18.2010 11.0800 3.3905 3.7404 2.1353 38.1849 3.3209 14.8603 39.1867 16.9059 22.8876 43.9840 22.3894 17.2611 31.5281 21.6940 3.2578 0.6377 4.6773 5.9960 3.1659 32.1955 11.8742 1.4137 5.2637 1.2376 6.1447 11.5015 11.1305 5.1407 2.6055 38.8308 9.5274 6.7705 1.8195 7.7273 11.2117 4.4734 9.2044 2.7327 2.8732 1.3185 26.4658 5.2785 5.8233 1.0350 2.7542 9.9888 0.9173 9.8808 1.9221 3.0106 0.7835 2.0577 0.9643 11.5696 15.5535 7.2754 2.3939 10.2106 0.0335 8.3213 0.9235 11.1976 12.1687 2.6911 13.2976 19.0244 3.6618 2.2167 13.7055 7.3287 9.9696 30.5818 44.5720 85.5567 31.3509 9.0391 22.0259 5.3760 34.0629 5.3525 21.7075 5.2276 11.5314 47.2759 5.6914 2.3348 108.4436 52.3935 33.7515 47.4000 27.6535 12.3354 17.7831
temp: 298.150 k
press: 1.00000 atm
elementType: 35 35 8 8 6 6 6 6 6 6 6 6 6 6 6 6 6 6 6 1 1 1 1 1 1 1 1 1 1 1 1 1 1 1 1 1 1 1 1 1 1 1 1 1 1
symmnumber: 1
zpe: 1009044.2 jmol-1
zpe.correction: 0.384325 hartree
zpe.thermalcorrener: 0.406185 hartree
zpe.thermalcorrenthalpy: 0.407129 hartree
zpe.thermalcorrgfe: 0.330326 hartree
zpe.sumelectzpe: -762.947537 hartree
zpe.sumelectthermal: -762.925677 hartree
zpe.sumelectthermalent: -762.924733 hartree
zpe.sumelectthermalfe: -763.001535 hartree
dipole: -2.1715 -1.5880 0.0272
dipole: 2.6903
quadrupole: -141.7234 -135.3998 -137.2598
quadrupole: -8.7124 7.0608 6.1308
quadrupole: -3.5957 2.7279 0.8679 -8.7124 7.0608 6.1308
hfenergy: -763.3318615 hartree
pointgroup: C01 [X(C15H26Br2O2)]
dipole: 0.5141935 -0.8607319 -0.3392419 debye
polarizability: 214.248267|-14.2504626|197.1780804|-22.1410035|11.9986414|186.0285261 unknown
InChI: InChI=1S/C15H26Br2O2/c1-3-5-6-7-12-15-8-11(17)14(19-15)9-13(18-12)10(16)4-2/h10-15H,3-9H2,1-2H3
charge 0 multiplicity 1
45 atoms
Br 3.685081 -1.862203 -2.175745
Br -0.120822 3.436631 1.739052
O  1.937494 -1.272829 1.489665
O  -0.003463 0.449124 0.377905
C  1.023264 -1.645558 0.342578
C  3.085565 -0.88375 0.66012
C  -0.296691 -0.994985 0.753277
C  1.757201 -2.917389 -0.110009
C  3.185003 -2.212695 -0.22668
C  2.654404 0.512978 0.054684
C  1.312383 1.066581 0.746424
C  -1.5457 -1.394098 -0.034635
C  1.152982 2.55495 0.371909
C  -2.797297 -0.578817 0.361061
C  0.653615 2.840558 -1.051904
C  -4.045807 -0.965081 -0.46161
C  -5.301821 -0.15298 -0.070857
C  0.72439 4.324376 -1.461951
C  -6.54727 -0.532493 -0.900596
H  1.229663 -0.99823 -0.535791
H  3.979276 -0.794069 1.297957
H  -0.457991 -1.061091 1.846198
H  1.784154 -3.713831 0.651953
H  1.428681 -3.325477 -1.078818
H  4.004705 -2.857161 0.122953
H  3.445146 1.252927 0.285657
H  2.563863 0.487233 -1.045374
H  1.452875 0.97426 1.838077
H  -1.72968 -2.473918 0.142902
H  -1.343983 -1.269194 -1.117444
H  2.097527 3.087927 0.58165
H  -3.00535 -0.729106 1.4411
H  -2.576767 0.497459 0.232345
H  -0.37223 2.447899 -1.154294
H  1.286012 2.24102 -1.7409
H  -3.836244 -0.813494 -1.54146
H  -4.257469 -2.048223 -0.334929
H  -5.512755 -0.305358 1.007321
H  -5.087158 0.927898 -0.1945
H  0.394961 4.453172 -2.508739
H  1.756151 4.716535 -1.381035
H  0.073891 4.943485 -0.82001
H  -6.372262 -0.359339 -1.979427
H  -7.430098 0.062319 -0.602065
H  -6.800327 -1.601862 -0.770112
