program: Gaussian 09
title: 000177009
version: EM64L-G09RevD.01
frameworkgroup: C1[X(C12H22N2)]
method: RPBEPBE
basis: SDD
operation: Freq
keyword: #pfreq=noraman
keyword: PBEPBE/SDD
title: #p freq=noraman PBEPBE/SDD
converged: YES YES NO NO
title: Mulliken charges:
elementType: N N C C C C C C C C C C C C H H H H H H H H H H H H H H H H H H H H H H
charge: -0.104996 -0.104996 -0.041179 -0.041171 -0.459290 -0.459287 -0.379759 -0.379761 -0.367976 -0.367976 -0.427382 -0.427383 -0.382552 -0.382548 0.194639 0.194637 0.208138 0.204103 0.208136 0.204104 0.185548 0.199136 0.185548 0.199135 0.206477 0.167303 0.206477 0.167305 0.192884 0.212192 0.192883 0.212192 0.203838 0.188872 0.203837 0.188872
chargesum: 0.00000
title: Mulliken charges with hydrogens summed into heavy atoms:
elementType: N N C C C C C C C C C C C C
charge: -0.104996 -0.104996 0.153460 0.153466 -0.047049 -0.047047 0.004924 0.004922 0.005805 0.005806 -0.022306 -0.022309 0.010159 0.010161
polarizability: 1.62725563e+02 -9.77902780e-05 1.38341643e+02 -8.45997260e-01 8.39272124e-05 1.08266023e+02
1716.lowfreq: -8.7601 -0.0001 0.0005 0.0007 15.2678 24.4238 67.5803 80.6243 155.4075
frequency: 67.4598 80.5691 155.3879 160.5993 209.0587 242.3380 265.2932 306.9631 321.5690 342.9874 356.3429 387.3446 406.3581 431.1910 433.9847 494.9192 499.0451 530.5005 536.9888 604.0925 747.6343 749.7860 819.7637 823.5959 852.2865 857.8182 871.0181 876.4790 905.9665 933.1764 955.1323 981.4818 992.7713 996.3732 1050.7210 1054.9721 1068.2311 1070.7544 1075.1047 1110.1507 1115.4827 1118.9127 1129.3879 1131.1741 1141.9529 1154.0096 1182.9954 1185.8282 1204.1520 1223.1814 1231.4172 1249.7127 1257.1959 1267.2834 1269.3837 1285.7968 1287.8807 1300.7838 1323.5218 1338.0224 1338.3648 1340.9750 1341.9209 1343.1602 1348.0092 1351.4433 1352.5137 1360.6619 1386.8099 1398.4926 1447.4227 1451.8102 1453.8647 1455.8075 1459.0092 1461.7844 1468.9417 1469.0398 1477.0542 1477.5488 2798.0173 2809.7429 2815.6058 2822.1412 2845.8721 2860.7732 2964.6403 2965.0928 2976.4515 2978.2719 2983.0696 2983.2903 3011.9928 3012.6975 3015.2120 3019.9153 3029.4577 3030.2728 3042.3664 3047.2255 3051.3569 3055.6849
redmass: 2.6342 2.8868 2.5149 2.4090 3.3739 2.0977 2.0557 1.7613 2.0703 2.5217 2.3106 4.0060 3.3034 3.7517 2.5670 2.6351 2.9118 1.7636 2.2083 1.9056 2.9423 2.8258 1.4853 1.7704 1.6035 1.7130 2.5521 2.4762 1.6053 2.6459 1.5906 2.1822 2.1514 1.7281 1.9097 1.8350 1.6273 1.9238 2.2343 2.0315 1.7670 1.8723 2.8459 2.6673 2.2801 1.7568 1.8369 1.6480 1.5853 1.3445 1.3327 1.8591 1.3023 1.2514 1.1701 1.3574 1.2798 1.3861 1.2901 1.3677 1.3729 1.3619 1.4083 1.4614 1.4824 1.5573 1.4496 1.5521 1.4138 1.5518 1.0912 1.0889 1.0910 1.0911 1.0891 1.0878 1.0969 1.0971 1.0929 1.0959 1.0755 1.0760 1.0710 1.0778 1.0705 1.0685 1.0621 1.0623 1.0618 1.0632 1.0620 1.0620 1.0885 1.0872 1.0891 1.0867 1.0964 1.0964 1.1023 1.1019 1.1034 1.0998
irintensity: 0.0014 0.7807 0.0163 1.4859 0.0146 0.0780 4.9861 2.5236 0.6063 0.8826 0.1367 2.7080 0.2592 0.0843 2.0012 1.6565 1.1575 0.0960 2.3160 2.0158 9.4151 0.0000 1.4211 0.0159 7.8625 4.7252 0.0167 4.4386 1.1311 4.5582 6.0049 3.4361 0.1252 1.1919 14.3317 0.0084 39.0176 2.3525 1.7213 13.3052 28.0660 2.9169 17.8261 17.7269 0.0541 1.0400 12.6176 26.9426 8.2514 3.0111 3.5745 13.9808 1.4257 4.0771 8.9215 14.6651 11.1627 20.4378 12.4157 1.2895 2.5142 0.9677 6.8255 0.8422 11.0941 17.6717 0.5619 0.0130 1.0436 0.0220 2.2063 21.8819 4.3777 1.8505 0.1865 19.0164 11.9313 2.2831 13.6509 0.5300 24.6986 71.3879 0.0881 164.2572 58.6652 220.9679 47.5418 37.3376 35.3852 14.7222 67.0314 0.4205 10.5505 41.5085 64.0633 125.5678 77.2065 26.7183 34.1649 13.7591 160.8162 21.7913
temp: 298.150 k
press: 1.00000 atm
elementType: 7 7 6 6 6 6 6 6 6 6 6 6 6 6 1 1 1 1 1 1 1 1 1 1 1 1 1 1 1 1 1 1 1 1 1 1
symmnumber: 1
zpe: 857292.2 jmol-1
zpe.correction: 0.326525 hartree
zpe.thermalcorrener: 0.338897 hartree
zpe.thermalcorrenthalpy: 0.339841 hartree
zpe.thermalcorrgfe: 0.288817 hartree
zpe.sumelectzpe: -578.836636 hartree
zpe.sumelectthermal: -578.824264 hartree
zpe.sumelectthermalent: -578.823320 hartree
zpe.sumelectthermalfe: -578.874344 hartree
dipole: 0.0000 -0.1837 0.0000
dipole: 0.1837
quadrupole: -84.0334 -84.1919 -89.4565
quadrupole: 0.0000 -2.1623 0.0001
quadrupole: 1.8605 1.7021 -3.5626 0.0000 -2.1623 0.0001
hfenergy: -579.163161 hartree
pointgroup: C01 [X(C12H22N2)]
dipole: -0.0000105 0.0722676 -0.0000173 debye
polarizability: 162.7147346|0.0004077|138.3416429|1.142506|0.0002697|108.2768513 unknown
InChI: InChI=1S/C12H22N2/c1-3-7-13-9-10-14-8-4-2-6-12(14)11(13)5-1/h11-12H,1-10H2
charge 0 multiplicity 1
36 atoms
N  -1.43993 -0.866723 0.170657
N  1.439938 -0.866678 -0.170686
C  -0.736082 0.38061 -0.255534
C  0.736056 0.380625 0.255496
C  -1.510023 1.613597 0.272584
C  1.509959 1.613646 -0.272612
C  -0.711797 -2.074856 -0.279293
C  0.71184 -2.074848 0.279197
C  -2.853731 -0.90941 -0.282224
C  2.853735 -0.909332 0.282201
C  -2.995895 1.600578 -0.149256
C  2.995832 1.600657 0.149215
C  -3.660933 0.275109 0.274555
C  3.660904 0.275201 -0.274594
H  -0.695813 0.430382 -1.378676
H  0.69577 0.430403 1.378638
H  -1.03217 2.538102 -0.099039
H  -1.441125 1.619833 1.37925
H  1.032079 2.538122 0.099048
H  1.441052 1.619906 -1.379277
H  -0.661363 -2.133663 -1.397476
H  -1.255472 -2.967356 0.086098
H  0.661398 -2.133724 1.397375
H  1.25554 -2.967314 -0.086244
H  -3.289032 -1.868012 0.060326
H  -2.918218 -0.89907 -1.404579
H  3.28906 -1.867927 -0.060329
H  2.918223 -0.89897 1.404555
H  -3.067882 1.71017 -1.251625
H  -3.523591 2.465763 0.296131
H  3.067823 1.710256 1.251586
H  3.523513 2.465852 -0.296174
H  -3.688077 0.205606 1.379291
H  -4.703551 0.221023 -0.094576
H  3.688035 0.205685 -1.379331
H  4.70353 0.221159 0.094521
