program: Gaussian 09
title: 000177100
version: EM64L-G09RevD.01
frameworkgroup: C1[X(C18H22N4O9S)]
method: RPBEPBE
basis: SDD
operation: Freq
keyword: #p
keyword: freq=noraman
keyword: PBEPBE/SDD
title: #p freq=noraman PBEPBE/SDD
converged: NO YES NO NO
title: Mulliken charges:
elementType: S O O O O O O O O O N N N N C C C C C C C C C C C C C C C C C C H H H H H H H H H H H H H H H H H H H H H H
charge: 0.941059 -0.265157 -0.437573 -0.455655 -0.454671 -0.509191 -0.509961 -0.415574 -0.205164 -0.255689 -0.405730 -0.083106 -0.069929 -0.683986 -0.190743 -0.088945 -0.142567 -0.107516 -0.083398 0.170847 0.274604 -0.068630 -0.447496 -0.229369 -0.162498 0.197027 -0.004316 -0.400076 -0.407142 0.518956 -0.743829 -0.509245 0.331434 0.272761 0.208704 0.262264 0.258388 0.347225 0.365736 0.367261 0.315393 0.289189 0.304642 0.377827 0.234685 0.231392 0.236613 0.249510 0.237646 0.318178 0.318319 0.229934 0.240196 0.237367
chargesum: 0.00000
title: Mulliken charges with hydrogens summed into heavy atoms:
elementType: S O O O O O O O O O N N N N C C C C C C C C C C C C C C C C C C
charge: 0.941059 -0.265157 -0.090348 -0.089920 -0.087410 -0.509191 -0.509961 -0.037747 -0.205164 -0.255689 -0.405730 -0.083106 -0.069929 -0.047489 0.140691 0.183816 0.066137 0.154748 0.174990 0.170847 0.274604 -0.068630 -0.132102 0.059821 0.142144 0.197027 -0.004316 -0.165392 -0.175750 0.518956 -0.020059 0.198253
polarizability: 3.54366414e+02 -1.16562092e+01 2.93540283e+02 5.67331312e+00 -1.16646152e+01 2.55428459e+02
1716.lowfreq: -13.1036 -5.5446 -0.0008 0.0008 0.0019 1.6484 8.9720 18.0644 21.5166
frequency: -10.9726 17.9775 21.3991 30.3362 32.5012 38.3824 51.1801 56.7109 63.7278 72.5691 83.5182 101.2874 104.0349 115.2982 130.4720 148.5075 150.5198 156.8132 173.2709 182.3812 193.2456 197.2893 208.0854 210.5418 221.7189 229.1090 232.3548 237.9055 239.1987 265.9516 280.7864 292.1096 319.8406 332.2474 338.4922 367.4159 384.1122 395.6128 398.3008 409.2238 411.6242 419.9707 427.9172 444.1440 451.3174 458.1687 462.7514 481.9518 511.2887 519.6889 534.9975 553.5009 569.6765 587.2852 598.1637 601.4218 603.1631 621.0762 624.5023 635.5881 661.8112 702.1331 709.3054 745.4064 761.1322 802.6955 811.3345 816.2375 832.8970 859.4295 865.9689 898.0455 909.5177 918.2049 932.0613 943.3342 951.9263 957.0552 962.1361 965.9426 975.5824 989.0153 1005.4369 1009.7432 1022.8243 1028.7154 1043.7930 1046.9281 1050.0270 1067.4025 1079.1762 1081.4118 1095.7571 1112.0806 1124.1304 1137.8610 1154.1311 1184.4319 1191.0089 1191.7987 1222.9332 1231.0193 1241.4337 1255.5320 1272.1149 1276.5569 1294.9544 1303.7674 1308.7015 1329.3779 1334.0749 1348.7370 1351.6687 1366.9553 1371.4607 1380.5660 1384.6561 1395.7863 1400.0697 1404.1138 1412.4264 1438.8532 1446.4233 1450.2664 1458.1477 1461.1819 1465.3727 1490.0225 1511.6997 1549.2814 1578.9966 1611.8151 1649.5677 1678.6626 2901.0233 2921.8796 2992.8635 2997.6078 3002.7927 3017.3754 3081.1511 3105.2647 3111.5095 3132.2825 3136.8306 3139.3386 3142.3207 3156.5534 3168.3958 3190.2650 3510.1120 3533.5663 3541.1260 3559.8968 3569.6276 3698.4332
redmass: 4.3557 6.1587 5.7728 6.8288 5.7790 5.5160 6.6542 1.1217 4.7519 6.5417 5.6998 4.2334 6.4412 6.6929 7.2948 6.0669 6.7553 1.1876 5.2420 6.8508 2.9698 5.9965 2.2210 1.9652 3.4990 7.6013 5.0306 7.6708 6.1663 6.1325 6.8474 5.1456 5.9713 6.0612 5.0672 3.5869 1.3269 3.6588 5.9387 2.8628 5.3617 1.0673 6.1184 3.7754 1.5526 1.9287 1.8200 4.9060 2.8678 6.1452 4.1797 4.2563 4.8501 3.0003 3.3591 7.1022 2.8735 5.6850 2.3705 5.0163 10.3795 4.3974 2.9286 6.2404 4.5613 5.1323 1.3844 7.6131 1.8407 5.5370 5.9642 1.5097 7.1764 8.8895 5.7305 9.5367 1.3796 6.6721 6.3295 1.3449 5.3325 2.4855 3.9049 4.7178 1.4506 3.2762 2.5688 2.6389 1.6503 2.6680 3.2277 2.0088 4.4722 1.2542 2.1035 1.2155 1.5400 1.3298 1.2080 1.1861 1.1927 2.2464 1.3502 1.6235 1.8459 2.4288 1.2688 1.2367 1.3317 2.3720 1.3924 1.6359 2.5349 2.2949 2.8123 1.5720 1.1565 1.5569 5.1573 1.8012 1.5550 3.9606 1.6921 1.0517 1.0810 1.1117 1.0634 2.8238 7.6170 5.6535 7.2038 4.8440 1.2219 9.2749 1.0806 1.0823 1.0833 1.0383 1.0291 1.0852 1.0958 1.1044 1.0867 1.1001 1.0888 1.0894 1.1050 1.0975 1.0960 1.0946 1.0638 1.0653 1.0661 1.0454 1.0659 1.1040
irintensity: 0.2916 1.4931 0.5000 0.4948 1.0093 1.9767 0.6370 0.4940 0.4370 1.4625 3.0908 5.7811 8.0180 0.3101 0.7184 0.3058 1.3014 0.2291 1.0201 4.2445 3.6937 0.6588 24.6317 28.6176 24.6776 11.1026 5.8152 11.4119 13.4018 45.5715 11.6141 1.9403 24.5039 4.6992 1.0109 14.4585 105.4632 9.1720 6.6294 5.8649 21.6171 0.3427 83.3352 46.3284 284.4671 128.9281 178.1570 16.4951 22.7056 1.7026 59.5617 63.7710 13.8491 40.8473 13.1449 28.4806 62.1270 6.8157 26.2531 26.1967 10.0919 38.9496 6.6042 10.0821 2.6533 32.0622 9.2841 89.2273 75.3814 5.8005 83.1899 32.3283 36.4482 33.1565 60.4140 77.5390 7.2179 112.0133 241.7984 1.8831 10.0095 15.4003 40.9502 74.6201 3.4547 85.8160 44.4866 37.9345 7.1871 94.4140 40.1336 43.4389 44.1209 0.3984 21.9476 10.0295 31.1231 6.2894 94.1002 6.2730 39.3603 252.7595 27.8732 15.8596 22.8556 162.2066 64.0673 3.9308 12.4276 58.6556 25.5835 12.1518 22.2570 8.5990 184.8620 22.5601 25.6372 72.0611 3.8870 30.3282 3.2885 3.7185 10.4598 12.6699 21.1318 44.8167 22.0024 62.7214 165.1455 704.9700 11.9099 212.6718 280.0103 210.1513 7.3132 34.4736 9.9384 9.6319 54.5468 29.4499 10.7513 25.5960 3.2721 9.5309 17.4719 6.3495 22.8951 22.2664 9.8560 4.8128 21.8641 28.5957 7.4176 132.2698 25.8778 26.0472
temp: 298.150 k
press: 1.00000 atm
elementType: 16 8 8 8 8 8 8 8 8 8 7 7 7 7 6 6 6 6 6 6 6 6 6 6 6 6 6 6 6 6 6 6 1 1 1 1 1 1 1 1 1 1 1 1 1 1 1 1 1 1 1 1 1 1
symmnumber: 1
zpe: 1046061.8 jmol-1
zpe.correction: 0.398424 hartree
zpe.thermalcorrener: 0.430946 hartree
zpe.thermalcorrenthalpy: 0.431891 hartree
zpe.thermalcorrgfe: 0.333208 hartree
zpe.sumelectzpe: -1990.603485 hartree
zpe.sumelectthermal: -1990.570962 hartree
zpe.sumelectthermalent: -1990.570018 hartree
zpe.sumelectthermalfe: -1990.668700 hartree
dipole: -6.0099 3.4844 -4.1596
dipole: 8.0971
quadrupole: -172.0600 -168.1447 -201.7063
quadrupole: -19.3198 23.8404 -17.1545
quadrupole: 8.5770 12.4923 -21.0693 -19.3198 23.8404 -17.1545
hfenergy: -1991.0019086 hartree
pointgroup: C01 [X(C18H22N4O9S1)]
dipole: -2.224474 -1.9654349 1.1563289 debye
polarizability: 350.756844|18.9105761|300.3295248|2.9620019|-1.2207249|252.2487878 unknown
InChI: InChI=1S/C18H22N4O9S/c1-8-20-11(7-12(21-8)30-2)22(32(28,29)10-5-3-9(19)4-6-10)17-15(25)13(23)14(24)16(31-17)18(26)27/h3-7,13-17,23-26H,19H2,1-2H3
charge 0 multiplicity 1
54 atoms
S  -0.506427 -0.332673 -2.316024
O  1.854513 -0.427684 0.212484
O  2.146556 3.156945 -1.045731
O  4.646504 2.712142 0.33394
O  5.549692 -0.053585 0.488962
O  0.870353 -0.835162 -3.023685
O  -1.611732 0.460318 -3.201536
O  3.03051 -3.168204 0.614808
O  3.65351 -1.875176 2.441469
O  -4.231947 2.285105 0.449029
N  0.190591 0.887727 -0.925289
N  -0.241574 1.58909 1.303864
N  -2.454923 2.283798 2.011924
N  -3.292998 -4.868892 0.535148
C  2.358457 1.955353 -0.225313
C  1.593488 0.707562 -0.737965
C  3.860223 1.605338 -0.212416
C  4.16353 0.382241 0.664962
C  3.287271 -0.805064 0.231667
C  3.365984 -1.956401 1.232888
C  -0.724769 1.364752 0.033336
C  -1.358069 -1.704357 -1.396852
C  -2.072549 1.619863 -0.310331
C  -2.74183 -1.868596 -1.602318
C  -0.592229 -2.550093 -0.570214
C  -2.901468 2.061607 0.74762
C  -1.118055 2.061529 2.230712
C  -3.387752 -2.931597 -0.952649
C  -1.249093 -3.609246 0.074208
C  -2.653211 -3.81878 -0.105711
C  -0.589701 2.362848 3.610593
C  -5.08699 2.791345 1.545454
H  1.996423 2.219354 0.778239
H  2.009047 0.401224 -1.728542
H  4.187217 1.38833 -1.256973
H  3.955544 0.638549 1.723104
H  3.607918 -1.162506 -0.768481
H  2.082064 2.905292 -2.003544
H  4.325511 3.545141 -0.101405
H  6.135609 0.702136 0.749115
H  -2.45662 1.520264 -1.326363
H  -3.289233 -1.185633 -2.259197
H  0.477965 -2.376132 -0.414935
H  3.085886 -3.901711 1.286552
H  -4.463393 -3.081171 -1.098268
H  -0.6782 -4.279494 0.726488
H  -1.223783 1.884623 4.37695
H  0.446334 2.006555 3.70711
H  -0.618448 3.451673 3.80039
H  -2.778907 -5.503812 1.139692
H  -4.290869 -5.023125 0.419127
H  -6.078282 2.905021 1.083277
H  -4.707357 3.757148 1.918863
H  -5.114691 2.071421 2.380467
