program: Gaussian 09
title: 000176932
version: EM64L-G09RevD.01
frameworkgroup: C1[X(C18H22N2)]
method: RPBEPBE
basis: SDD
operation: Freq
keyword: #pfreq=noraman
keyword: PBEPBE/SDD
title: #p freq=noraman PBEPBE/SDD
converged: YES YES NO NO
title: Mulliken charges:
elementType: N N C C C C C C C C C C C C C C C C C C H H H H H H H H H H H H H H H H H H H H H H
charge: -0.049000 -0.468222 -0.062905 -0.359195 -0.335721 -0.432270 0.246893 -0.407410 0.618293 -0.409529 -0.083622 0.115942 -0.648112 0.200506 -0.716016 -0.818677 -0.411478 -0.367987 -0.265942 -0.221614 0.208424 0.253547 0.224330 0.212337 0.205083 0.206658 0.211246 0.225776 0.192651 0.305117 0.213195 0.220705 0.216169 0.217539 0.211292 0.216039 0.229727 0.202433 0.231314 0.231273 0.220228 0.220987
chargesum: 0.00000
title: Mulliken charges with hydrogens summed into heavy atoms:
elementType: N N C C C C C C C C C C C C C C C C C C
charge: -0.049000 -0.163105 0.145518 -0.105648 -0.111390 -0.014850 0.246893 0.010494 0.618293 0.008897 -0.083622 0.115942 0.001955 0.200506 -0.071146 -0.386517 -0.180164 -0.136714 -0.045714 -0.000628
polarizability: 2.71502135e+02 2.90777894e+01 2.23966600e+02 -8.09142406e+00 -5.49893211e+00 1.44828212e+02
1716.lowfreq: -9.6609 -0.0007 -0.0005 -0.0002 7.4725 8.7373 46.1826 70.3986 84.9893
frequency: 45.9523 70.3680 84.9623 93.3283 119.6737 144.8675 158.7353 188.2688 204.9246 228.5710 242.7917 258.1233 280.1600 294.1414 329.6619 348.4230 379.8644 387.8027 419.3115 427.9744 459.0137 470.5608 498.8856 509.8274 525.1541 552.6465 565.9457 589.0951 618.9304 641.3291 674.7280 681.8306 739.1227 751.3036 756.6418 762.1874 793.4312 810.2587 831.0256 845.8809 852.4907 871.7928 896.6528 902.6317 929.8199 935.6797 939.7173 969.0567 970.8615 1008.7356 1014.8621 1021.0388 1047.4669 1060.3112 1073.8277 1084.3696 1108.7225 1112.8720 1118.7033 1132.0124 1148.3693 1163.8442 1168.2345 1186.6338 1201.9699 1223.7528 1237.3075 1241.7660 1254.1804 1263.2886 1281.4974 1303.3973 1312.8634 1323.1906 1331.7369 1341.9404 1346.5504 1358.2744 1364.4690 1371.6378 1392.9217 1403.9196 1430.4610 1433.8431 1441.1258 1453.8068 1458.8294 1464.5003 1467.2863 1475.4963 1477.0864 1482.5556 1487.4982 1490.3053 1535.6127 1580.5558 1623.4759 1638.8418 2871.9291 2891.7835 2970.6302 2974.3255 2980.4723 2987.2198 2998.4376 3011.6442 3012.6667 3018.8122 3029.8682 3049.4276 3065.8267 3069.0086 3071.7715 3088.2071 3123.0786 3130.8738 3144.5748 3161.9412 3188.7365 3610.9759
redmass: 3.5354 2.4627 3.6680 3.6324 2.6317 3.9834 2.1879 3.1173 2.4465 1.2026 1.4734 2.8591 3.6703 2.4888 2.8076 3.1680 3.5287 3.5574 3.3796 2.9768 3.9224 3.5563 1.3091 3.2481 2.9609 3.0016 3.3079 4.8641 5.5503 2.6090 2.3063 3.0373 1.8682 1.8458 1.8602 2.9610 1.9695 4.0377 2.6637 1.6727 2.0595 2.6999 1.4627 3.2370 1.3898 2.0323 2.4053 1.3668 2.4453 2.1365 2.0855 1.7183 2.0108 1.8978 2.4270 2.2317 1.7539 1.4467 1.5477 2.0167 2.5210 1.2917 1.2496 2.7240 1.6200 1.5838 1.6657 1.9292 1.6083 1.3824 1.3275 1.5329 1.3887 1.3896 1.8896 1.5273 1.6234 1.5307 1.6857 1.6658 1.2129 2.8663 1.1686 1.4998 4.2684 1.1052 1.0675 3.1760 1.1802 1.0782 1.0571 3.0471 1.0541 1.0601 4.4925 6.0760 7.1342 5.4310 1.0695 1.0517 1.0591 1.0400 1.0681 1.0804 1.0810 1.0850 1.0789 1.0873 1.0969 1.1030 1.1005 1.0992 1.0997 1.0624 1.0847 1.0889 1.0952 1.1001 1.1125 1.0800
irintensity: 0.2611 0.1548 0.3300 0.1156 0.7041 0.5107 1.1377 0.8596 0.6785 0.0684 0.1367 2.6098 0.9877 3.4317 1.4339 10.6682 0.3203 0.6559 3.0826 7.2260 0.1380 10.2037 53.9398 8.6186 13.1504 4.9968 2.5665 4.2363 3.1549 7.6495 2.0112 6.9240 36.4357 59.4314 16.0767 4.1835 13.0034 0.3381 9.3812 3.6167 3.4724 4.7463 70.1272 7.9292 2.6099 1.0291 6.5136 0.1772 0.8261 12.7590 5.5757 5.4103 22.4571 7.2010 0.4092 9.9090 16.1378 3.8692 4.3994 4.9900 7.3110 0.2297 1.9590 3.8166 8.9614 2.5505 6.8087 5.8378 9.7448 2.8648 6.9663 7.0597 2.3423 6.7063 29.2701 11.0888 17.5605 0.2276 7.3557 0.9163 14.4419 15.1878 5.9556 8.2260 15.2577 12.1575 19.2621 2.5470 1.9145 4.3735 8.6365 0.8449 11.1345 8.5833 5.4194 2.3638 19.0303 56.3266 45.3310 99.2790 28.1580 25.6315 14.8765 8.6893 71.6112 37.8663 52.2897 68.1600 27.3450 36.4363 39.9099 49.4184 63.6889 10.0454 1.1973 3.3444 35.5753 36.8989 18.1963 39.9777
temp: 298.150 k
press: 1.00000 atm
elementType: 7 7 6 6 6 6 6 6 6 6 6 6 6 6 6 6 6 6 6 6 1 1 1 1 1 1 1 1 1 1 1 1 1 1 1 1 1 1 1 1 1 1
symmnumber: 1
zpe: 941775.5 jmol-1
zpe.correction: 0.358703 hartree
zpe.thermalcorrener: 0.376138 hartree
zpe.thermalcorrenthalpy: 0.377083 hartree
zpe.thermalcorrgfe: 0.314909 hartree
zpe.sumelectzpe: -807.148612 hartree
zpe.sumelectthermal: -807.131177 hartree
zpe.sumelectthermalent: -807.130233 hartree
zpe.sumelectthermalfe: -807.192406 hartree
dipole: 0.0349 1.5095 -0.4785
dipole: 1.5839
quadrupole: -115.3834 -110.0815 -123.1443
quadrupole: -0.7148 0.4400 -1.9535
quadrupole: 0.8197 6.1216 -6.9412 -0.7148 0.4400 -1.9535
hfenergy: -807.5073155 hartree
pointgroup: C01 [X(C18H22N2)]
dipole: -0.0164954 -0.5967883 -0.1785882 debye
polarizability: 271.6366302|29.4345046|224.2874352|4.4388731|3.5414611|144.3728812 unknown
InChI: InChI=1S/C18H22N2/c1-4-12-13-9-10-20(3)18(12)16-14-7-5-6-8-15(14)19-17(16)11(13)2/h5-8,12-13,18-19H,2,4,9-10H2,1,3H3
charge 0 multiplicity 1
42 atoms
N  -1.396689 1.738496 -1.138393
N  1.094486 -1.9108 -0.193827
C  -2.1808 0.50589 0.865371
C  -0.950215 1.183587 0.191381
C  -2.583947 -0.714298 -0.021075
C  -2.979195 -0.174123 -1.430843
C  0.169561 0.165811 0.075852
C  -1.864045 0.68011 -2.070009
C  -1.462764 -1.764595 -0.107978
C  -1.967363 0.122365 2.349078
C  -0.116123 -1.200046 -0.09522
C  1.608242 0.307275 0.076221
C  -0.39623 2.625834 -1.767527
C  2.165062 -1.016305 -0.09284
C  -1.713858 1.327585 3.281227
C  -1.737202 -3.100514 -0.202032
C  2.495016 1.410196 0.210006
C  3.556668 -1.250452 -0.133818
C  3.883596 1.180528 0.174553
C  4.408977 -0.135326 0.003248
H  -3.00702 1.244014 0.81146
H  -0.623809 2.054071 0.790443
H  -3.473032 -1.205241 0.421414
H  -3.886179 0.450593 -1.313909
H  -3.228779 -1.014394 -2.105848
H  -1.025036 0.017573 -2.397984
H  -2.255146 1.178307 -2.977456
H  -1.130731 -0.596541 2.439032
H  -2.876112 -0.41391 2.692458
H  1.176244 -2.916393 -0.323178
H  -0.113393 3.42436 -1.057261
H  -0.844161 3.105255 -2.657485
H  0.53508 2.101855 -2.090167
H  -0.754782 1.827801 3.053072
H  -2.519333 2.081109 3.188767
H  -1.672094 1.006162 4.338225
H  -2.769009 -3.466984 -0.186715
H  -0.957709 -3.867043 -0.293997
H  2.104096 2.425787 0.337614
H  3.96657 -2.258174 -0.265377
H  4.576987 2.022598 0.277442
H  5.49477 -0.281021 -0.022322
