program: Gaussian 09
title: 000176920
version: EM64L-G09RevD.01
frameworkgroup: C1[X(C16H16O7)]
method: RPBEPBE
basis: SDD
operation: Freq
keyword: #pfreq=noraman
keyword: PBEPBE/SDD
title: #p freq=noraman PBEPBE/SDD
converged: YES YES NO NO
title: Mulliken charges:
elementType: O O O O O O O C C C C C C C C C C C C C C C C H H H H H H H H H H H H H H H H
charge: -0.301382 -0.433413 -0.443642 -0.440913 -0.260039 -0.413194 -0.416813 -0.114748 -0.232747 -0.502280 0.241680 0.561310 0.266636 0.174407 -0.621323 -0.618902 -0.659456 -0.589726 0.373282 0.238841 0.246217 0.040198 -0.516430 0.209990 0.236369 0.219991 0.274015 0.283777 0.228823 0.246192 0.353254 0.245255 0.361649 0.356474 0.356839 0.361315 0.224661 0.233811 0.230026
chargesum: 0.00000
title: Mulliken charges with hydrogens summed into heavy atoms:
elementType: O O O O O O O C C C C C C C C C C C C C C C C
charge: -0.301382 -0.080159 -0.081994 -0.084439 -0.260039 -0.056356 -0.055499 0.095242 0.003621 -0.008274 0.241680 0.561310 0.266636 0.174407 -0.375131 -0.335125 -0.430633 -0.344471 0.373282 0.238841 0.246217 0.040198 0.172067
polarizability: 2.93448509e+02 4.80605066e+00 1.97206534e+02 4.31028222e+00 1.01275053e+01 1.25026320e+02
1716.lowfreq: -68.7991 -5.4293 -2.2719 -0.3256 -0.0004 0.0003 0.0006 24.8710 31.4409
frequency: -68.7958 24.8518 31.4027 42.7848 76.4119 90.7878 115.6533 148.8643 160.4882 182.5691 195.3748 208.9646 212.9074 229.7179 242.9003 254.6595 295.9538 297.3705 302.7192 308.4867 330.9369 336.5320 342.5239 360.3437 369.5721 371.0955 379.4808 438.9079 448.7015 479.8610 498.4015 519.4043 538.0623 573.9903 576.0574 584.2227 587.0471 595.8318 604.7520 645.1795 683.3611 694.3935 707.1542 750.1294 763.2065 794.4998 797.7124 817.5921 821.3290 845.0066 861.9459 875.3068 936.4231 950.3862 983.3447 984.5767 994.9007 1021.6403 1038.7468 1058.8605 1105.1575 1110.6637 1118.0798 1152.9359 1154.0930 1161.2373 1173.3062 1186.8047 1196.9343 1199.4529 1209.0793 1222.2886 1235.4348 1244.3652 1262.6690 1284.3820 1320.0717 1328.3377 1350.6180 1358.0935 1373.8834 1401.7203 1411.5462 1417.0786 1429.9472 1441.3514 1453.0540 1463.2688 1465.8666 1510.9853 1527.7888 1605.1235 1607.5063 1619.7649 1635.6379 2948.8373 2966.0195 2967.8449 2992.4298 3062.4510 3063.6751 3107.6412 3121.8259 3140.6243 3147.4647 3153.3835 3500.7550 3579.5961 3580.3423 3587.9521 3589.9514
redmass: 2.8038 5.9658 6.3667 5.5334 6.8108 4.8574 4.7909 1.1719 4.4081 4.9637 7.0140 5.2163 5.5913 4.3785 5.5152 5.7464 5.9734 4.7361 4.7712 2.5202 3.2757 1.2106 1.1995 1.2810 1.2748 1.3151 2.0844 5.8535 5.8157 6.3892 5.1027 5.5413 6.1707 6.6884 5.3160 4.5470 4.3573 5.1204 3.5671 4.8612 4.4851 2.7564 5.1293 5.6955 3.3196 1.9549 2.6922 1.9330 1.9346 2.4995 1.9271 2.4813 3.9017 8.7536 4.8242 4.8688 3.6247 2.7962 3.1445 3.1873 1.2393 2.2731 2.0972 1.3473 1.3759 1.2598 1.2804 1.2524 1.3610 1.4535 1.6167 2.5834 1.4840 1.5146 1.2725 1.4679 1.6630 3.2527 3.0245 2.3784 1.8210 5.8402 5.6249 3.4789 1.1603 1.6596 1.8529 1.0533 1.0535 3.5438 3.2885 7.0242 6.8895 6.8322 7.8798 1.0829 1.0835 1.0305 1.0690 1.1053 1.0940 1.0913 1.1012 1.0913 1.0920 1.0926 1.0655 1.0661 1.0661 1.0660 1.0661
irintensity: 6.8141 0.2893 0.7533 0.8341 4.6606 2.1414 0.9007 0.1648 2.0997 8.5922 1.8027 9.8531 1.7044 2.8067 2.6640 3.5720 1.5449 5.5841 28.0694 10.7382 10.5965 105.7931 117.5254 2.0102 82.2684 250.0184 37.6254 31.4927 9.3130 6.4464 2.0197 4.6118 9.0750 5.9268 20.4147 3.2960 0.4997 12.5206 18.9553 12.7248 10.7914 6.4090 12.1269 8.4831 42.8326 5.8306 18.3475 75.8379 8.4867 5.2901 15.4105 15.5756 37.1765 40.8539 141.6677 202.3483 39.4126 85.0898 81.8741 146.2431 0.5836 76.2553 280.3080 2.4657 2.6982 108.1500 68.5060 28.8772 46.2111 30.9605 64.5830 263.2173 83.0044 133.4664 11.7320 8.5786 28.3632 35.1267 59.6491 21.1417 11.0719 44.6400 2.7491 60.1412 1.0959 18.4882 62.4624 11.4214 12.8668 141.4953 73.9368 67.9015 48.4930 181.6078 194.2874 30.0919 31.5096 69.6584 53.7663 35.5729 4.7630 10.7382 32.7107 2.0089 4.2368 3.7254 17.9368 66.2246 14.0211 37.8466 39.1469
temp: 298.150 k
press: 1.00000 atm
elementType: 8 8 8 8 8 8 8 6 6 6 6 6 6 6 6 6 6 6 6 6 6 6 6 1 1 1 1 1 1 1 1 1 1 1 1 1 1 1 1
symmnumber: 1
zpe: 769399.8 jmol-1
zpe.correction: 0.293049 hartree
zpe.thermalcorrener: 0.314183 hartree
zpe.thermalcorrenthalpy: 0.315128 hartree
zpe.thermalcorrgfe: 0.243473 hartree
zpe.sumelectzpe: -1144.130604 hartree
zpe.sumelectthermal: -1144.109469 hartree
zpe.sumelectthermalent: -1144.108525 hartree
zpe.sumelectthermalfe: -1144.180179 hartree
dipole: 1.0922 -1.5814 -0.3648
dipole: 1.9562
quadrupole: -139.9293 -116.8947 -133.3955
quadrupole: 9.1072 -7.4202 8.9165
quadrupole: -9.8561 13.1785 -3.3224 9.1072 -7.4202 8.9165
hfenergy: -1144.4236528 hartree
pointgroup: C01 [X(C16H16O7)]
dipole: 0.4368434 -0.605929 -0.1853175 debye
polarizability: 293.3347131|5.7001524|195.6525898|4.2714108|14.9074337|126.6940604 unknown
InChI: InChI=1S/C16H16O7/c1-22-16-11(19)2-7(3-12(16)20)15-13(21)6-9-10(18)4-8(17)5-14(9)23-15/h2-5,13,15,17-21H,6H2,1H3
charge 0 multiplicity 1
39 atoms
O  0.908669 0.598229 -0.466993
O  0.357063 -1.241867 1.802119
O  4.855532 -2.052972 0.549327
O  5.286356 2.692671 -0.3898
O  -5.458916 0.681148 -0.058779
O  -4.712385 -1.515252 -1.550964
O  -3.5553 2.142181 1.327854
C  0.563469 -1.713293 0.431493
C  0.126369 -0.645876 -0.618912
C  2.055979 -2.038872 0.281211
C  2.885676 -0.789155 0.056811
C  -1.33878 -0.273879 -0.484424
C  2.29705 0.451664 -0.27899
C  4.29314 -0.803817 0.220328
C  3.054711 1.635073 -0.434644
C  -1.730255 0.798472 0.348912
C  -2.319778 -1.058324 -1.131798
C  5.088618 0.350737 0.069649
C  4.451114 1.569073 -0.252449
C  -3.692395 -0.766069 -0.947919
C  -3.10563 1.090451 0.517691
C  -4.106921 0.32132 -0.132322
C  -6.192326 0.114757 1.09219
H  -0.043702 -2.625379 0.242507
H  0.327866 -1.064579 -1.627728
H  2.195416 -2.753827 -0.553579
H  2.397209 -2.557636 1.193571
H  -0.956259 1.427935 0.802592
H  -2.019591 -1.89115 -1.782122
H  2.54226 2.566238 -0.699224
H  -0.557512 -0.858987 1.874858
H  6.176423 0.332436 0.19398
H  5.829507 -1.96843 0.698421
H  4.754846 3.497233 -0.609088
H  -4.328883 -2.209388 -2.142674
H  -2.787919 2.658098 1.680399
H  -6.197397 -0.99074 1.043053
H  -7.219714 0.49788 1.000482
H  -5.746209 0.457595 2.044557
