program: Gaussian 09
title: 000176850
version: EM64L-G09RevD.01
frameworkgroup: C1[X(C20H22N2O3)]
method: RPBEPBE
basis: SDD
operation: Freq
keyword: #p
keyword: freq=noraman
keyword: PBEPBE/SDD
title: #p freq=noraman PBEPBE/SDD
converged: YES YES NO NO
title: Mulliken charges:
elementType: O O O N N C C C C C C C C C C C C C C C C C C C C H H H H H H H H H H H H H H H H H H H H H H
charge: -0.303156 -0.293175 -0.311984 -0.380943 0.001949 -0.019702 -0.032319 -0.720778 -0.730468 -0.764989 0.284476 -0.189457 0.536977 -0.528528 -0.437121 0.348218 -0.199139 -0.392192 -0.192580 0.349554 -0.356015 -0.383189 -0.204209 -0.192355 -0.247435 0.237960 0.244444 0.219570 0.220732 0.206766 0.222590 0.221601 0.211030 0.234802 0.219195 0.237318 0.327061 0.290015 0.286567 0.271058 0.233821 0.262460 0.263381 0.257979 0.228240 0.230954 0.231015
chargesum: 0.00000
title: Mulliken charges with hydrogens summed into heavy atoms:
elementType: O O O N N C C C C C C C C C C C C C C C C C C C C
charge: -0.303156 -0.293175 -0.311984 -0.053883 0.001949 0.218258 0.212125 -0.073710 -0.075246 -0.073674 0.284476 0.100558 0.536977 -0.241961 -0.166063 0.348218 0.034682 -0.129731 -0.192580 0.349554 -0.092634 -0.125209 0.024031 0.038599 -0.016420
polarizability: 3.00007082e+02 2.43467044e+01 2.42395020e+02 -1.55053030e+01 -1.68459447e+01 1.78389454e+02
1716.lowfreq: -12.5613 -2.6506 -0.0004 -0.0004 0.0006 4.9547 8.2190 12.3244 23.8350
frequency: -8.2648 11.5597 23.7688 28.7170 41.3041 53.4984 58.1548 62.9058 65.5199 94.0244 100.8909 144.9305 178.1768 193.7062 196.1223 217.9256 224.1002 241.6791 247.1743 257.1378 263.2836 284.6364 300.9006 321.8137 336.1595 362.6688 378.8231 396.9937 410.1979 426.6905 451.8764 479.7298 502.4886 544.5835 555.6841 560.5823 563.5796 589.5796 611.9967 621.6930 635.6179 685.3359 691.6395 693.3673 698.7817 733.9527 761.1133 764.2050 808.5558 823.5347 834.8209 861.2096 884.0089 901.4125 902.9544 914.7598 918.2677 919.7073 953.0597 957.6120 968.4381 969.0916 985.2984 986.3299 987.1334 988.5862 996.1082 1019.6727 1023.4506 1038.2513 1077.4537 1087.7760 1132.6664 1141.5646 1144.2119 1158.0073 1167.9994 1172.6671 1177.3263 1185.7920 1195.9699 1213.8265 1235.7977 1280.8407 1282.1627 1292.4288 1307.5036 1312.6104 1325.0865 1349.7033 1360.7549 1378.6429 1381.8299 1389.3516 1391.8963 1399.8035 1440.1090 1445.5040 1461.9931 1467.5689 1470.4821 1470.9001 1477.8202 1478.6408 1484.4009 1488.5583 1491.1455 1594.9223 1595.7104 1606.6507 1613.7782 1672.2109 2204.7476 2972.5703 2976.5284 2985.4544 2988.8788 3001.1314 3007.6361 3064.5367 3071.1725 3071.6664 3075.5878 3079.9465 3100.7822 3132.0002 3139.2939 3141.3825 3150.6983 3156.3590 3156.7779 3165.4371 3174.5004 3175.6052 3556.7926
redmass: 3.8085 5.3951 4.8758 4.8978 4.1085 3.0424 4.6220 6.0652 5.9846 6.1672 6.2066 4.2711 5.8779 1.5172 1.8009 4.4112 1.2289 1.9989 1.9988 2.8932 2.8928 3.1831 5.5865 6.2532 3.9546 3.5252 5.3093 2.8694 2.9177 6.5235 3.4898 3.3536 4.0479 2.7694 1.3993 3.2001 5.8004 5.1812 6.2699 6.3592 6.3025 4.8444 9.2623 2.5064 2.7911 3.5761 2.7156 1.7038 1.5776 5.4852 1.2787 3.8939 2.1379 1.6770 2.1100 1.4413 1.2208 1.5125 3.3155 1.3414 1.8412 2.1950 1.7177 3.1973 3.4461 1.5010 3.9015 2.0818 1.5122 2.1068 1.5030 1.6009 2.4268 1.9958 2.3502 2.1392 1.1767 1.1520 1.1311 2.0668 2.2862 2.1495 2.5949 1.6136 1.2433 1.5313 1.3501 1.2271 1.4323 1.4216 1.3302 1.2233 7.9028 1.2522 7.7048 1.2127 2.4063 2.5357 1.2916 1.2359 1.1245 2.0217 1.0828 2.5108 1.0707 1.0688 1.0659 6.3800 6.4741 6.4495 6.4699 10.3858 12.5977 1.0359 1.0365 1.0724 1.0481 1.0822 1.0851 1.0999 1.0991 1.0990 1.0983 1.0987 1.0984 1.0850 1.0876 1.0890 1.0920 1.0935 1.0930 1.0966 1.0983 1.1004 1.0774
irintensity: 0.0654 0.3100 0.0039 0.7479 0.7865 0.1871 1.2637 1.9526 9.3686 1.5255 0.4170 0.8980 5.2259 2.6815 2.4628 1.6354 0.2644 2.1508 3.8358 7.0229 0.4428 3.8906 1.1074 1.5763 5.7979 5.1468 4.9670 0.8533 0.5390 7.9289 6.2946 24.5654 9.2134 2.7636 81.1981 22.4690 1.8410 1.8418 3.0791 5.7226 6.8679 8.4792 27.9127 24.0701 21.7292 2.3477 11.4272 102.1800 57.8840 38.8002 1.7876 61.7755 5.5296 23.5233 83.1935 3.4756 1.3277 0.8160 33.8049 1.0004 95.5055 118.6875 3.0208 17.2323 0.2230 0.7484 80.3828 13.8556 7.2020 106.6218 10.4916 7.3291 6.0687 7.4338 18.6797 16.6485 32.3921 31.5099 0.8774 156.8164 131.8068 146.9596 196.4425 69.4302 9.3976 8.8579 0.8390 5.1776 12.5927 22.2843 2.3291 22.1702 6.4425 19.7012 6.1848 31.8008 28.8099 65.1057 220.8108 126.8958 86.7272 103.7775 21.7440 24.4527 2.9442 24.5130 37.2216 9.3148 140.3716 39.4403 3.7149 262.8223 1.3311 35.5303 19.8740 22.8272 8.3258 28.7111 7.7667 21.0666 14.0433 48.4098 80.9652 27.5502 27.4619 1.7731 5.4725 9.5927 5.5031 0.2990 29.1351 14.1628 9.8819 7.1215 32.2965
temp: 298.150 k
press: 1.00000 atm
elementType: 8 8 8 7 7 6 6 6 6 6 6 6 6 6 6 6 6 6 6 6 6 6 6 6 6 1 1 1 1 1 1 1 1 1 1 1 1 1 1 1 1 1 1 1 1 1 1
symmnumber: 1
zpe: 987308.5 jmol-1
zpe.correction: 0.376046 hartree
zpe.thermalcorrener: 0.400072 hartree
zpe.thermalcorrenthalpy: 0.401016 hartree
zpe.thermalcorrgfe: 0.319403 hartree
zpe.sumelectzpe: -1108.671203 hartree
zpe.sumelectthermal: -1108.647177 hartree
zpe.sumelectthermalent: -1108.646232 hartree
zpe.sumelectthermalfe: -1108.727846 hartree
dipole: 2.2696 -1.2833 -4.0260
dipole: 4.7966
quadrupole: -129.3739 -138.5278 -159.1963
quadrupole: -2.9533 -5.3624 3.4331
quadrupole: 12.9921 3.8382 -16.8303 -2.9533 -5.3624 3.4331
hfenergy: -1109.0472487 hartree
pointgroup: C01 [X(C20H22N2O3)]
dipole: 0.9257595 -0.5240721 -1.558685 debye
polarizability: 290.0476971|30.0147585|246.61064|-18.5116549|-27.1998716|184.1332184 unknown
InChI: InChI=1S/C20H22N2O3/c1-14(2)15(3)22-20(23)25-19(13-21)16-8-7-11-18(12-16)24-17-9-5-4-6-10-17/h4-12,14-15,19,22H,1-3H3
charge 0 multiplicity 1
47 atoms
O  1.378786 -0.181823 0.626584
O  2.77469 1.712219 0.317705
O  -4.20158 0.078695 -0.541748
N  3.325461 -0.410643 -0.531701
N  -0.285339 -0.622029 3.56059
C  5.74886 0.011093 -0.015084
C  4.637797 -0.037568 -1.116659
C  7.046206 0.649961 -0.563591
C  6.029625 -1.36676 0.626748
C  4.936756 -0.986129 -2.293826
C  2.545327 0.48624 0.139246
C  0.427529 0.715242 1.367608
C  -0.735296 1.115988 0.469276
C  -1.918946 0.343685 0.411163
C  -0.592395 2.274182 -0.334883
C  -2.952478 0.735472 -0.468797
C  -1.641151 2.654631 -1.200817
C  -2.823868 1.889545 -1.274348
C  0.030328 -0.031448 2.574465
C  -4.328776 -1.3085 -0.255783
C  -3.389332 -2.266402 -0.702678
C  -5.511595 -1.696894 0.408437
C  -3.64257 -3.634856 -0.460162
C  -5.753349 -3.069178 0.638237
C  -4.820056 -4.04227 0.209881
H  5.352281 0.684239 0.772083
H  4.523328 0.993844 -1.503363
H  6.845116 1.628236 -1.039721
H  7.768665 0.818618 0.255472
H  7.539465 -0.001423 -1.30945
H  6.732516 -1.257635 1.472612
H  5.106282 -1.829428 1.02194
H  6.489825 -2.067543 -0.094794
H  4.145128 -0.914087 -3.060418
H  5.005036 -2.039628 -1.964071
H  5.895361 -0.721086 -2.769546
H  3.005545 -1.379511 -0.577512
H  1.002557 1.616627 1.660377
H  -2.040662 -0.53581 1.052227
H  0.332536 2.858925 -0.284356
H  -1.539146 3.551505 -1.82054
H  -3.651189 2.169171 -1.933189
H  -2.486875 -1.952074 -1.236383
H  -6.218209 -0.926415 0.73071
H  -2.919413 -4.382884 -0.803331
H  -6.668735 -3.376069 1.155699
H  -5.008647 -5.105122 0.393792
