program: Gaussian 09
title: 000176810
version: EM64L-G09RevD.01
frameworkgroup: C1[X(C9H10Cl2N2O)]
method: RPBEPBE
basis: SDD
operation: Freq
keyword: #p
keyword: freq=noraman
keyword: PBEPBE/SDD
title: #p freq=noraman PBEPBE/SDD
converged: NO YES NO NO
title: Mulliken charges:
elementType: Cl Cl O N N C C C C C C C C C H H H H H H H H H H
charge: -0.049425 -0.054408 -0.218088 -0.082732 -0.244896 0.462143 -0.256310 -0.244805 -0.236632 -0.235490 -0.232298 -0.230186 -0.676719 -0.150871 0.260431 0.198393 0.256743 0.255266 0.237340 0.213507 0.224030 0.241706 0.241215 0.322084
chargesum: 0.00000
title: Mulliken charges with hydrogens summed into heavy atoms:
elementType: Cl Cl O N N C C C C C C C C C
charge: -0.049425 -0.054408 -0.218088 -0.082732 0.077188 0.462143 -0.256310 -0.244805 0.020111 0.019776 0.226527 0.007155 0.002525 0.090344
polarizability: 1.99195128e+02 6.81902965e+00 1.54671138e+02 1.21601715e+01 4.96512399e+00 7.54684347e+01
1716.lowfreq: -4.8368 -2.1196 -0.0022 0.0006 0.0022 5.7714 28.9223 38.0174 59.2566
frequency: 28.8438 37.8837 59.2436 64.2190 97.8341 132.9142 162.6561 196.6011 213.7338 227.1951 232.4520 282.4484 299.6775 330.4864 348.5656 384.8313 423.6335 473.4877 498.1684 524.4279 542.1667 566.3468 715.9737 726.8624 733.6441 759.4046 782.7296 822.9425 861.7269 888.2327 935.0913 943.5883 949.9530 1014.9062 1043.1270 1065.9980 1114.0710 1132.2734 1148.7727 1157.1461 1187.4994 1243.2744 1262.7263 1340.5149 1350.3288 1359.9810 1393.3666 1420.1821 1428.0975 1457.0973 1460.1454 1482.0936 1492.0583 1543.4469 1586.5016 1673.9251 2991.5363 2996.9371 3012.3980 3069.1057 3094.4204 3107.5282 3151.4971 3168.4114 3181.8562 3556.9844
redmass: 4.8229 3.0658 6.5222 3.6086 2.9975 7.0506 7.1653 4.7385 2.4679 2.4539 2.1389 9.8257 5.9202 2.7347 7.7983 8.4906 2.1836 2.4421 5.4270 5.8047 4.5327 5.4804 4.5961 6.9189 7.5979 1.3922 3.0387 1.0838 6.7237 1.3470 1.4861 4.3762 1.3195 2.5836 5.9396 2.4155 2.2291 1.3892 1.5339 2.5137 1.5025 1.1870 1.6893 5.2139 1.6314 1.3298 1.2529 2.6527 1.4009 1.7869 1.4289 1.0511 1.0924 6.6240 8.0376 7.6801 1.0563 1.0391 1.0890 1.1053 1.0986 1.1024 1.0866 1.0927 1.1000 1.0803
irintensity: 0.1780 0.4201 2.6995 2.8578 3.1433 4.5297 3.0316 0.0261 0.7600 29.6609 6.8583 0.3352 1.7595 106.3072 13.6997 2.8650 64.1436 5.0724 0.5324 10.0340 1.4317 1.8016 28.0128 24.3071 68.7710 56.6627 5.9656 5.6656 54.6504 0.1328 7.2348 17.9099 1.4497 41.6626 2.7983 20.7263 8.9193 2.9956 13.3935 35.6923 9.8807 4.5929 4.4341 26.4654 14.6906 0.2870 28.4343 29.3887 120.8269 5.6797 23.3084 6.8820 15.4854 22.5575 41.9738 745.2601 42.9825 27.5573 40.1935 3.7220 23.5893 37.7304 1.5869 2.2887 10.4235 75.3684
temp: 298.150 k
press: 1.00000 atm
elementType: 17 17 8 7 7 6 6 6 6 6 6 6 6 6 1 1 1 1 1 1 1 1 1 1
symmnumber: 1
zpe: 460180.5 jmol-1
zpe.correction: 0.175274 hartree
zpe.thermalcorrener: 0.190027 hartree
zpe.thermalcorrenthalpy: 0.190971 hartree
zpe.thermalcorrgfe: 0.131424 hartree
zpe.sumelectzpe: -1452.690763 hartree
zpe.sumelectthermal: -1452.676010 hartree
zpe.sumelectthermalent: -1452.675065 hartree
zpe.sumelectthermalfe: -1452.734612 hartree
dipole: -0.6153 -0.4715 -2.2246
dipole: 2.3558
quadrupole: -78.0484 -94.0721 -95.0199
quadrupole: 3.2047 5.4470 6.8002
quadrupole: 10.9984 -5.0253 -5.9731 3.2047 5.4470 6.8002
hfenergy: -1452.8660366 hartree
pointgroup: C01 [X(C9H10Cl2N2O1)]
dipole: 0.2382405 -0.0811551 -0.8920107 debye
dipolederiv: -0.3273115 0.3308366 -0.0233339 0.2705098 -0.5575578 0.0573429 -0.0146377 0.0362611 -0.0663144 -0.1317388 -0.1395744 0.0254112 -0.0757156 -0.7009765 0.1212406 0.0267163 0.1365149 -0.0812933 -0.4148997 0.0311497 0.0354665 0.1585273 -0.3400111 0.1472232 -0.2739321 0.0952546 -0.2307399 -1.7757406 -0.2374481 0.2868446 -0.5909318 -0.3457605 0.1955672 0.7178779 0.1708174 -0.5224444 -1.1223937 -0.1931556 0.4146028 0.1532941 -0.2727899 -0.1894708 0.5872082 -0.0806368 -0.1514587 1.4544999 0.2848267 -0.2509676 0.3780903 -0.2960442 0.0098715 -0.1924513 0.0323896 0.1322893 0.1333172 -0.4347183 0.0454565 -0.6741508 0.7379034 -0.0653943 0.0529613 -0.0811266 -0.0773969 -0.1685323 0.0752991 0.0088294 0.2272554 0.959264 -0.1899977 0.0097717 -0.1934738 -0.0875976 -0.0275947 0.0558423 -0.0133822 0.1032318 -0.0935193 -0.021638 -0.0000894 -0.0108033 -0.1062001 -0.0202109 0.0040248 -0.0003674 -0.0559265 -0.1411861 0.0090908 -0.0130931 0.0108615 -0.0988881 0.3563044 -0.1434185 -0.0044477 -0.4851435 0.4557816 -0.1120739 0.0708918 -0.0791806 0.3520666 -0.0912872 -0.0274931 -0.0154389 0.0026749 -0.0287207 -0.0290258 -0.0212289 -0.0282266 -0.1734395 -0.0207357 0.0477048 -0.0947409 0.1217734 0.0148278 0.0383865 -0.0993372 0.0212839 -0.0665096 1.9182772 0.3022866 -0.4377519 0.5991368 0.2443658 -0.2614307 -0.9044674 -0.2236197 0.5978125 0.0205907 -0.0843302 0.020516 -0.019942 -0.0078973 0.0250415 0.0184697 0.0174699 0.0466314 0.0067099 0.0710041 0.0515612 0.1082307 -0.0388106 -0.0267981 0.0996209 -0.0966922 -0.1343357 0.083633 -0.0289502 0.0214119 -0.0514663 -0.0288927 0.0484141 0.0242478 0.0406079 0.1536651 0.0283662 0.0627814 0.0122714 0.0879438 0.0101889 0.017018 0.0049707 0.0178198 0.1621716 -0.0927817 -0.020257 0.049484 -0.0196905 0.0610019 0.0243973 0.0501615 0.027668 0.1561498 0.0686555 0.036431 -0.0315197 0.0729924 -0.109803 0.0650656 -0.056766 0.050954 0.079847 -0.101442 -0.086062 0.0161487 -0.1455195 0.058207 0.0014767 0.0540135 0.0371865 0.0679491 0.0591484 0.0465044 0.0862899 0.0100739 0.0627781 -0.1062177 0.0599609 -0.072399 -0.0422568 0.0003519 0.0220041 -0.0949708 -0.112013 0.1044094 0.1213531 -0.0003717 0.0942084 -0.0976434 0.1648148 0.0247117 -0.107373 -0.063235 0.2532419 0.1205581 -0.2004975 0.0768611 0.187936 unknown
polarizability: 199.4242791|-0.6078012|145.7797011|-15.1690704|-24.2353533|84.1307205 unknown
InChI: InChI=1S/C9H10Cl2N2O/c1-2-14-13-6-12-9-7(10)4-3-5-8(9)11/h3-6,13H,2H2,1H3
charge 0 multiplicity 1
24 atoms
Cl -0.132362 -2.66748 0.286572
Cl -1.215231 2.770881 -0.604346
O  3.397676 0.817844 -0.270878
N  0.609769 0.192915 -0.281114
N  2.533129 0.941052 -1.414717
C  -0.770134 0.021013 -0.141657
C  -1.291384 -1.263102 0.21012
C  -1.7475 1.064285 -0.201722
C  -2.647436 -1.502932 0.483705
C  -3.11103 0.862823 0.076913
C  3.657094 -0.632713 0.041585
C  -3.565343 -0.429806 0.419214
C  4.592419 -0.614507 1.247029
C  1.1723 0.761861 -1.314069
H  2.688477 -1.111773 0.266907
H  4.12024 -1.105695 -0.846174
H  -2.978418 -2.51226 0.743404
H  -3.804914 1.706543 0.026532
H  -4.624044 -0.598716 0.636967
H  4.832374 -1.651363 1.544469
H  5.535872 -0.090771 1.014222
H  4.110775 -0.111799 2.102674
H  0.645447 1.078081 -2.233458
H  2.938221 1.535618 -2.139878
