program: Gaussian 09
title: 000176855
version: EM64L-G09RevD.01
frameworkgroup: C1[X(C21H22N2O3)]
method: RPBEPBE
basis: SDD
operation: Freq
keyword: #p
keyword: freq=noraman
keyword: PBEPBE/SDD
title: #p freq=noraman PBEPBE/SDD
converged: NO YES NO NO
title: Mulliken charges:
elementType: O O O N N C C C C C C C C C C C C C C C C C C C C C H H H H H H H H H H H H H H H H H H H H H H
charge: -0.303355 -0.296502 -0.311823 -0.400802 0.002674 -0.050099 -0.427148 -0.465275 -0.393213 -0.410858 -0.378130 0.303389 -0.191328 0.537413 -0.529438 -0.437250 0.349177 -0.194440 -0.198405 -0.393177 0.350109 -0.354166 -0.383906 -0.205793 -0.192666 -0.248865 0.251580 0.247303 0.196508 0.209433 0.219680 0.207053 0.206128 0.188124 0.211887 0.206201 0.194049 0.329986 0.288708 0.286883 0.273900 0.234018 0.262658 0.263347 0.257782 0.227373 0.230703 0.230574
chargesum: 0.00000
title: Mulliken charges with hydrogens summed into heavy atoms:
elementType: O O O N N C C C C C C C C C C C C C C C C C C C C C
charge: -0.303355 -0.296502 -0.311823 -0.070816 0.002674 0.201481 0.016663 -0.036162 0.019968 -0.010847 0.022120 0.303389 0.097380 0.537413 -0.242555 -0.163350 0.349177 -0.194440 0.035614 -0.130519 0.350109 -0.090819 -0.126124 0.021580 0.038037 -0.018291
polarizability: 2.96938654e+02 1.99031831e+01 2.52010592e+02 1.41023261e+01 2.43252216e+01 1.90640027e+02
1716.lowfreq: -5.3426 -3.6189 0.0004 0.0005 0.0008 3.5125 9.3461 21.2631 25.5996
frequency: 9.1419 21.2066 25.4569 29.8124 39.0667 53.8517 60.7983 69.6474 78.5748 96.9251 126.5343 167.3206 178.9848 194.0721 217.0319 222.5554 242.4128 260.8909 299.2563 304.9025 320.7689 362.2444 368.1470 379.8872 410.1581 414.7657 438.9679 451.8685 459.6044 481.2067 483.3280 542.1057 552.6860 562.3393 580.2163 610.7859 621.4703 631.7419 648.9391 684.2160 692.0806 697.6604 698.4115 733.6999 762.0483 777.9612 794.7476 809.7452 822.1760 830.1654 834.1931 857.2889 862.0083 881.5425 901.3100 914.7683 914.9990 920.2510 937.4187 957.8611 968.1150 984.4357 986.5020 986.9131 987.8545 995.7425 1006.0119 1014.4235 1020.1076 1047.1387 1054.9890 1078.4316 1088.8689 1089.2389 1116.1525 1142.0926 1149.4041 1158.0908 1167.9421 1173.1482 1178.6447 1189.1054 1196.6808 1233.3414 1246.7390 1259.3526 1273.9929 1279.2747 1281.8120 1303.5771 1308.4462 1326.6568 1328.8261 1332.8259 1338.8735 1352.1039 1358.1505 1367.0629 1382.2007 1391.5384 1440.2838 1445.4365 1457.2336 1463.2169 1465.5081 1470.9191 1471.5523 1475.1528 1478.8155 1487.9998 1594.6314 1595.7372 1606.6794 1613.9432 1672.6412 2204.5757 2958.5812 2967.1230 2978.2403 2982.2541 2984.2829 3006.5759 3012.2391 3031.2858 3033.8185 3042.1487 3047.4004 3059.0555 3131.4114 3140.6626 3141.1746 3149.4782 3156.5717 3158.5000 3165.1406 3174.8043 3175.1583 3560.9067
redmass: 6.0497 4.7838 5.4124 3.9989 4.2463 4.5178 5.3101 5.8381 6.2241 8.9647 4.7387 5.1857 5.8603 3.2691 3.8442 4.1759 3.6861 5.7845 4.6635 3.5697 7.0525 2.3585 2.6087 5.2851 2.9251 4.1175 4.8050 3.5196 2.8037 3.2784 2.0873 5.4712 1.1905 7.5886 5.4719 6.0052 6.1771 4.5771 3.3085 5.9642 2.3882 7.9867 2.6206 3.7117 1.6904 1.5225 3.1237 1.6820 4.4926 1.9054 1.3205 2.6087 2.2844 2.9383 1.5446 1.6762 1.6788 1.5468 2.0327 3.9832 1.3682 1.9466 3.2104 1.7676 2.1586 3.8663 3.0209 2.7372 2.0848 1.4940 1.7447 1.5040 1.6088 1.7192 1.0337 1.9590 2.3600 1.8267 1.1610 1.1736 1.1363 1.9938 2.2451 2.5696 1.3233 1.2891 1.2972 1.7111 1.2236 1.6975 1.3483 1.4234 1.4307 1.3570 1.4204 1.4402 1.4535 1.3489 7.6599 7.8177 2.4185 2.4792 1.2197 1.0856 1.3874 1.5438 1.4644 1.0827 2.5046 1.1620 6.4829 6.3347 6.3919 6.4624 10.2098 12.5973 1.0674 1.0623 1.0639 1.0645 1.0624 1.0821 1.0844 1.0947 1.0967 1.1010 1.1012 1.0997 1.0850 1.0890 1.0873 1.0922 1.0929 1.0936 1.0964 1.0988 1.1002 1.0772
irintensity: 0.2489 0.1270 0.3615 0.4870 0.6716 0.7460 2.1227 3.5500 5.9581 1.0231 2.0048 0.5452 7.4570 0.7322 1.9943 1.2464 3.0856 13.5592 0.8015 5.6334 3.9060 0.6568 1.8991 4.5466 0.5280 7.8605 0.5547 6.3576 6.0996 24.0266 1.1271 7.5491 92.5557 0.9977 2.0300 3.7091 4.2031 4.6946 3.9764 4.9948 31.7291 22.8767 24.5134 4.1204 101.6813 1.5489 7.9155 53.6349 32.2191 12.3098 2.7953 19.5027 7.9206 58.1279 10.4194 76.9745 31.8240 19.0589 84.0212 61.2775 0.3084 2.3073 9.8881 15.4943 2.9251 65.1725 89.2475 55.6775 12.3419 3.5764 9.9630 10.4672 7.5247 0.0461 2.4670 4.5200 5.3983 14.6733 28.1787 36.1156 0.8292 197.8847 151.7945 229.1932 9.9456 5.0431 14.6747 67.6359 7.1849 26.5311 0.7056 13.5089 6.7416 5.3086 0.7601 2.6957 2.1043 4.1716 7.7072 4.5710 35.1528 54.5215 127.2693 9.0097 275.2327 116.9531 77.5421 20.9950 21.9504 70.9033 6.0146 147.2965 34.7452 1.4763 273.7407 1.3335 25.3496 43.2137 25.2502 22.8802 16.6552 25.7115 46.8024 65.1441 51.9056 15.5854 85.4013 49.0732 1.8699 10.0749 7.1342 4.3918 24.1102 4.5862 14.0651 11.2730 5.8761 36.9067
temp: 298.150 k
press: 1.00000 atm
elementType: 8 8 8 7 7 6 6 6 6 6 6 6 6 6 6 6 6 6 6 6 6 6 6 6 6 6 1 1 1 1 1 1 1 1 1 1 1 1 1 1 1 1 1 1 1 1 1 1
symmnumber: 1
zpe: 1013537.1 jmol-1
zpe.correction: 0.386036 hartree
zpe.thermalcorrener: 0.409674 hartree
zpe.thermalcorrenthalpy: 0.410618 hartree
zpe.thermalcorrgfe: 0.328456 hartree
zpe.sumelectzpe: -1146.720950 hartree
zpe.sumelectthermal: -1146.697312 hartree
zpe.sumelectthermalent: -1146.696367 hartree
zpe.sumelectthermalfe: -1146.778529 hartree
dipole: -2.7510 2.1453 -3.8264
dipole: 5.1780
quadrupole: -133.3215 -143.2623 -165.6431
quadrupole: -4.1171 3.5787 1.5664
quadrupole: 14.0875 4.1466 -18.2341 -4.1171 3.5787 1.5664
hfenergy: -1147.1069855 hartree
pointgroup: C01 [X(C21H22N2O3)]
dipole: -1.2519908 0.6329386 -1.4771521 debye
polarizability: 281.0440115|27.5824835|261.0107859|11.0592597|35.3591779|197.5344756 unknown
InChI: InChI=1S/C21H22N2O3/c22-15-20(26-21(24)23-17-9-3-1-4-10-17)16-8-7-13-19(14-16)25-18-11-5-2-6-12-18/h2,5-8,11-14,17,20,23H,1,3-4,9-10H2
charge 0 multiplicity 1
48 atoms
O  -1.022997 -0.396572 0.72993
O  -1.896866 -2.445402 -0.087664
O  4.384177 0.907209 -0.470706
N  -3.00122 -0.393652 -0.399278
N  0.6167 -0.173576 3.695858
C  -4.168012 -0.930029 -1.146343
C  -5.131386 -1.717386 -0.216718
C  -4.902613 0.239881 -1.845064
C  -5.856928 -0.792195 0.786767
C  -5.647345 1.162237 -0.845654
C  -6.605749 0.35058 0.059314
C  -1.995895 -1.19706 0.052505
C  0.136223 -1.182052 1.275088
C  1.325534 -1.122564 0.324867
C  2.277907 -0.079818 0.406599
C  1.445093 -2.127904 -0.667119
C  3.341695 -0.046764 -0.52236
C  0.40334 -0.616613 2.609983
C  2.524629 -2.08565 -1.576545
C  3.476764 -1.046729 -1.51121
C  4.14807 2.242839 -0.046312
C  2.958402 2.944742 -0.350114
C  5.224033 2.876596 0.611576
C  2.851351 4.301448 0.028933
C  5.103369 4.234444 0.979064
C  3.917363 4.951351 0.693754
H  -3.767411 -1.62578 -1.908237
H  -4.564838 -2.509263 0.30538
H  -5.879101 -2.223955 -0.860485
H  -5.642055 -0.200856 -2.541486
H  -4.188142 0.819834 -2.461442
H  -6.563909 -1.383937 1.398566
H  -5.116756 -0.358964 1.489881
H  -4.921907 1.710085 -0.207198
H  -6.206011 1.935748 -1.406009
H  -7.093155 1.019895 0.793794
H  -7.413936 -0.082354 -0.56631
H  -2.946979 0.603273 -0.185491
H  -0.206808 -2.2309 1.376109
H  2.203508 0.682983 1.18909
H  0.691763 -2.920583 -0.727238
H  2.625875 -2.863988 -2.339943
H  4.323437 -0.99659 -2.202095
H  2.139164 2.448409 -0.879553
H  6.131142 2.302132 0.82141
H  1.933067 4.851678 -0.204284
H  5.935243 4.729818 1.491461
H  3.825871 6.003353 0.983435
