program: Gaussian 09
title: 000176802
version: EM64L-G09RevD.01
frameworkgroup: C1[X(C12H18N2O2)]
method: RPBEPBE
basis: SDD
operation: Freq
keyword: #p
keyword: freq=noraman
keyword: PBEPBE/SDD
title: #p freq=noraman PBEPBE/SDD
converged: YES YES NO NO
title: Mulliken charges:
elementType: O O N N C C C C C C C C C C C C H H H H H H H H H H H H H H H H H H
charge: -0.269984 -0.227672 -0.088378 -0.255797 0.388526 0.091391 0.347903 -0.563887 -0.347365 -0.378460 -0.812688 -0.239727 -0.687207 -0.182846 -0.224381 -0.680027 0.253465 0.227431 0.240822 0.216490 0.226971 0.243266 0.204498 0.203554 0.204291 0.230796 0.231568 0.217362 0.248993 0.197767 0.309220 0.210297 0.224456 0.239350
chargesum: 0.00000
title: Mulliken charges with hydrogens summed into heavy atoms:
elementType: O O N N C C C C C C C C C C C C
charge: -0.269984 -0.227672 -0.088378 0.053423 0.388526 0.091391 0.347903 -0.310422 -0.119934 -0.137638 -0.125960 0.168325 -0.020552 0.034517 0.222379 -0.005924
polarizability: 2.71627487e+02 4.45484860e+00 1.52769714e+02 7.02341474e+00 -4.90163681e-02 9.29130523e+01
1716.lowfreq: -7.8125 -4.3997 -3.2361 -0.0009 -0.0006 -0.0003 25.5283 33.4871 50.0818
frequency: 25.4543 33.4240 50.0566 68.4765 83.9941 96.4054 109.2844 110.4505 148.7254 167.4724 195.8187 214.5798 230.2648 235.5382 244.3083 290.1585 314.5485 332.2864 357.4211 391.4635 422.7479 448.6563 459.2419 494.7831 547.9706 571.5919 587.8317 677.0411 722.7972 734.7610 783.8120 796.5761 820.6225 830.5511 841.6293 870.9630 883.3215 911.6514 926.6037 945.0317 953.1361 1000.4316 1021.6215 1044.1474 1046.5688 1102.1097 1116.2971 1117.4586 1133.6131 1137.0132 1155.4866 1170.7144 1226.6382 1237.5765 1247.1848 1261.4154 1274.5866 1348.5978 1354.6144 1359.7901 1376.6074 1392.1363 1393.4813 1398.6415 1423.6327 1424.2180 1453.0901 1458.9077 1460.1342 1475.3648 1478.1428 1482.6067 1486.0580 1490.3356 1495.0682 1569.1690 1619.4593 1649.3438 2947.4689 2957.1228 2977.3453 2988.2534 2995.2451 2995.8962 3003.4188 3055.6276 3060.3827 3088.1153 3092.4983 3092.9269 3104.6375 3104.7487 3121.9829 3148.2560 3160.3238 3538.1694
redmass: 3.7563 3.1213 3.5487 2.3418 4.1949 2.7654 1.7910 1.0780 3.4909 4.9466 3.1174 2.5499 1.5416 2.1130 1.4514 3.1836 3.9875 3.3280 4.4195 2.8636 2.8400 2.6830 2.5871 5.0631 3.5985 5.1973 3.0361 4.9030 5.6781 3.4208 2.4882 1.5902 1.0884 1.1326 3.5758 4.3913 1.4397 1.3922 1.4983 3.2594 3.0263 1.5916 2.7572 2.4643 1.6021 2.8241 2.1871 2.1039 1.3923 1.4408 2.4135 1.6338 2.5024 1.2124 2.2321 1.1414 1.6330 1.5941 1.9748 1.4378 1.9006 1.2537 1.2610 1.3051 1.3935 2.4986 1.0588 1.0415 1.0402 1.3665 1.1897 1.0529 1.4337 1.0884 1.3471 7.5841 6.4146 6.8211 1.0553 1.0861 1.0368 1.0565 1.0382 1.0361 1.1072 1.0958 1.1054 1.1002 1.0987 1.0989 1.1012 1.1020 1.0882 1.0916 1.0941 1.0794
irintensity: 0.5924 0.2349 1.0503 1.5481 0.9101 1.3264 3.4999 0.7043 2.5019 3.1003 15.0572 3.3070 13.1996 10.0037 0.2479 3.1512 3.4932 101.2787 2.3965 96.1578 60.4821 13.1955 5.6664 28.3567 13.8210 14.1613 5.8186 3.3290 14.2711 4.0728 17.8014 45.2208 5.3224 0.6515 0.8501 39.2517 25.5527 1.7890 13.0458 9.6292 22.6420 10.3081 57.7862 86.6128 25.9614 2.6257 5.0480 29.3903 9.8354 4.2495 145.2634 66.6656 79.2331 1.4648 27.4443 0.0857 79.4815 12.1778 1.1344 1.8210 20.9024 37.4657 9.7867 53.3236 52.2924 38.3840 13.9880 8.9432 11.3943 10.3653 31.6289 6.3786 120.8976 17.9035 46.0486 1.9505 23.9432 522.2245 43.3404 56.9043 29.3076 46.2002 32.3170 28.2056 41.5003 20.1484 7.9988 25.9468 26.9718 32.3159 32.8001 44.9376 19.1562 8.6971 18.3682 53.1526
temp: 298.150 k
press: 1.00000 atm
elementType: 8 8 7 7 6 6 6 6 6 6 6 6 6 6 6 6 1 1 1 1 1 1 1 1 1 1 1 1 1 1 1 1 1 1
symmnumber: 1
zpe: 737175.6 jmol-1
zpe.correction: 0.280775 hartree
zpe.thermalcorrener: 0.298766 hartree
zpe.thermalcorrenthalpy: 0.299710 hartree
zpe.thermalcorrgfe: 0.233429 hartree
zpe.sumelectzpe: -726.724336 hartree
zpe.sumelectthermal: -726.706345 hartree
zpe.sumelectthermalent: -726.705401 hartree
zpe.sumelectthermalfe: -726.771682 hartree
dipole: -0.6675 -2.3562 -1.3907
dipole: 2.8162
quadrupole: -77.4593 -84.1139 -99.4718
quadrupole: -5.3547 7.2407 1.9830
quadrupole: 9.5557 2.9011 -12.4568 -5.3547 7.2407 1.9830
hfenergy: -727.005111 hartree
pointgroup: C01 [X(C12H18N2O2)]
dipole: -0.2313312 0.6641701 0.8561565 debye
polarizability: 270.8424017|-1.1524026|144.8493618|-14.0752113|20.360802|101.6184898 unknown
InChI: InChI=1S/C12H18N2O2/c1-4-15-11-6-7-12(10(3)8-11)13-9-14-16-5-2/h6-9,14H,4-5H2,1-3H3
charge 0 multiplicity 1
34 atoms
O  3.922426 -0.466111 -0.399313
O  -4.45543 0.965097 0.046782
N  -1.665845 0.277231 0.174009
N  -3.578505 1.287025 1.152251
C  0.284891 -1.139435 -0.247282
C  -0.253864 0.151764 0.073058
C  2.555018 -0.178925 -0.227447
C  1.678633 -1.281924 -0.386148
C  0.633031 1.253103 0.207372
C  2.029691 1.102342 0.062953
C  -0.642038 -2.326165 -0.418072
C  4.877032 0.645101 -0.245277
C  6.272863 0.063302 -0.456674
C  -2.206389 1.093429 1.037169
C  -4.796621 -0.493781 0.06852
C  -5.753494 -0.70079 -1.102953
H  2.114717 -2.25777 -0.624665
H  0.221502 2.254766 0.382429
H  2.679341 1.977357 0.158697
H  -0.095414 -3.211209 -0.786523
H  -1.130034 -2.594642 0.538206
H  -1.455203 -2.08183 -1.12528
H  4.653474 1.433643 -0.99424
H  4.774846 1.085448 0.768806
H  7.036202 0.856193 -0.353818
H  6.482001 -0.72418 0.287431
H  6.360489 -0.379721 -1.463437
H  -1.650557 1.644467 1.824945
H  -3.858226 -1.063978 -0.050199
H  -5.26476 -0.735416 1.042781
H  -3.935009 2.093837 1.670006
H  -6.050039 -1.763946 -1.158339
H  -6.665541 -0.089989 -0.985172
H  -5.266588 -0.425893 -2.054072
