program: Gaussian 09
title: 000012793
version: EM64L-G09RevD.01
frameworkgroup: C1[X(C6H7O4P)]
method: RPBEPBE
basis: SDD
operation: Freq
keyword: #pfreq=noraman
keyword: PBEPBE/SDD
title: #p freq=noraman PBEPBE/SDD
converged: YES YES NO NO
title: Mulliken charges:
elementType: P O O O O C C C C C C H H H H H H H
charge: 1.379364 -0.592976 -0.644009 -0.659218 -0.582540 0.395007 -0.352905 -0.366471 -0.198176 -0.190810 -0.243725 0.286180 0.255019 0.233754 0.233733 0.233342 0.401669 0.412763
chargesum: 0.00000
title: Mulliken charges with hydrogens summed into heavy atoms:
elementType: P O O O O C C C C C C
charge: 1.379364 -0.592976 -0.242339 -0.246456 -0.582540 0.395007 -0.066725 -0.111452 0.035578 0.042923 -0.010383
polarizability: 1.30176472e+02 7.27979357e-01 1.01423679e+02 -6.76131150e+00 -4.14560291e-01 5.76727806e+01
1716.lowfreq: -12.7088 -3.5031 0.0020 0.0022 0.0023 6.9208 26.3186 44.2316 94.5925
frequency: 26.2844 44.1518 94.5852 119.3032 193.9843 216.4951 241.1628 266.0620 313.1182 328.3472 361.6420 407.9613 409.8148 482.6657 545.7087 606.5988 636.9951 691.0185 703.5150 762.2750 767.3557 835.4382 840.4838 914.9234 970.9633 978.9123 986.5285 992.0249 1007.6546 1021.4343 1077.5823 1113.6119 1163.9785 1173.4454 1188.0990 1312.2581 1382.0548 1441.8560 1471.8698 1595.8103 1604.8118 3134.9841 3144.4795 3157.0518 3167.6589 3178.1300 3581.0956 3589.8228
redmass: 4.8482 6.5702 6.0510 2.1373 3.0071 3.8668 1.5515 3.1338 6.5515 2.6314 8.4443 8.6163 2.9098 3.8757 5.2173 6.7074 9.8283 2.2420 9.7805 3.1129 2.3786 1.3120 5.7677 1.4120 1.3709 1.5790 5.8008 1.3372 1.3059 2.1088 1.5236 3.1245 1.6044 1.2434 1.5009 1.3157 9.4465 2.2431 2.2191 6.1780 6.7224 1.0853 1.0894 1.0940 1.0974 1.1000 1.0657 1.0664
irintensity: 0.7792 2.1841 10.3802 111.6923 19.9818 12.1078 66.3906 55.4648 14.9293 32.0395 14.9705 61.7244 0.6874 29.9398 4.6762 2.0545 17.8980 25.3973 178.2350 93.5657 311.8366 17.6078 233.6770 12.7565 0.6078 104.4664 1.8068 1.0642 10.8034 14.3593 17.7605 190.9539 62.8153 29.1114 51.0898 0.5272 0.4778 8.2216 97.0974 36.9213 18.9776 0.1761 12.4771 12.0890 15.1688 7.3287 89.1124 67.6851
temp: 298.150 k
press: 1.00000 atm
elementType: 15 8 8 8 8 6 6 6 6 6 6 1 1 1 1 1 1 1
symmnumber: 1
zpe: 324463.2 jmol-1
zpe.correction: 0.123582 hartree
zpe.thermalcorrener: 0.135090 hartree
zpe.thermalcorrenthalpy: 0.136034 hartree
zpe.thermalcorrgfe: 0.084879 hartree
zpe.sumelectzpe: -874.127526 hartree
zpe.sumelectthermal: -874.116017 hartree
zpe.sumelectthermalent: -874.115073 hartree
zpe.sumelectthermalfe: -874.166229 hartree
dipole: -2.2165 -1.7919 1.2658
dipole: 3.1186
quadrupole: -68.1272 -68.5660 -70.0233
quadrupole: -5.2473 2.9764 4.8345
quadrupole: 0.7783 0.3395 -1.1178 -5.2473 2.9764 4.8345
hfenergy: -874.2511075 hartree
pointgroup: C01 [X(C6H7O4P1)]
dipole: -0.8980337 -0.6173112 0.5638321 debye
dipolederiv: 2.580483 -0.1648709 -0.0081397 0.3064461 1.6662044 0.1477579 0.3419017 0.2152982 2.0555441 -2.1046751 0.0649752 -0.0456336 -0.1240611 -0.4915768 -0.0344891 0.049589 -0.0134287 -0.4351287 -0.7141374 0.1019352 -0.0299309 0.0478695 -0.4230197 0.0433872 -0.2637539 -0.0082862 -1.1415186 -0.8188231 0.2844569 0.0746193 0.4404658 -0.7729231 -0.1493366 0.1030182 -0.0873215 -0.7327603 -0.7554187 -0.055183 0.0056275 -0.0992161 -0.6046258 0.0381852 -0.0468213 -0.0301459 -0.6461616 1.4946641 -0.0164961 0.0221008 -0.4299879 0.1405653 -0.0813464 -0.1657805 -0.0309429 0.0850312 -0.2371924 0.0255531 -0.0281916 0.2270522 -0.1121756 -0.0075308 -0.0368713 -0.0112268 -0.1519189 -0.368741 -0.0385986 -0.0247522 -0.0689578 0.0171202 -0.027225 -0.0075626 -0.0367643 -0.1467714 0.0344238 -0.0202814 -0.0258163 -0.063454 0.1364261 -0.0666239 0.0049216 -0.0650877 -0.1157681 0.1077678 0.0399958 -0.037033 0.0277697 0.0729177 -0.0621599 -0.0176253 -0.0544012 -0.1178584 0.0384057 -0.0557618 -0.0233716 -0.0165199 -0.1214328 0.0017368 -0.018675 -0.0018419 -0.1714039 0.0629161 -0.0597634 0.0419967 -0.0615522 0.0726946 0.02538 0.0386502 0.0242005 0.1641177 0.0924272 0.0672104 0.0004522 0.0610074 -0.0162631 0.0442815 -0.0131041 0.0418935 0.1573982 0.0546215 0.0490705 -0.0037558 0.0694368 -0.074242 0.0530303 -0.0079241 0.0497228 0.1453842 -0.0185113 -0.0917626 0.0373568 -0.091117 -0.0085635 0.0509865 0.0460577 0.0489985 0.1423408 -0.1116878 0.0465354 0.0196855 0.0482341 0.0841662 0.0142962 0.0164672 0.0121348 0.1616642 0.3490537 -0.0731704 0.0102506 -0.0710778 0.1726148 0.0139522 -0.0086872 -0.0356334 0.3506419 0.3144239 -0.1038445 0.0145351 -0.2023377 0.2621131 -0.0042821 -0.0138001 -0.0171677 0.3971676 unknown
polarizability: 130.7205868|0.4152291|99.8862574|-2.4733833|-8.131245|58.666087 unknown
InChI: InChI=1S/C6H7O4P/c7-11(8,9)10-6-4-2-1-3-5-6/h1-5,7-8H
charge 0 multiplicity 1
18 atoms
P  2.318239 0.315612 0.178854
O  0.974808 -0.637215 -0.353514
O  2.266796 0.021409 1.875529
O  3.520743 -0.714964 -0.445304
O  2.460905 1.838719 -0.223048
C  -0.389406 -0.227282 -0.214041
C  -0.796503 1.096258 -0.490272
C  -1.307663 -1.232053 0.149858
C  -2.170439 1.411733 -0.386104
C  -2.678326 -0.90062 0.234624
C  -3.112733 0.419941 -0.028119
H  -0.063923 1.856646 -0.780894
H  -0.945987 -2.242753 0.359937
H  -2.501442 2.43479 -0.594643
H  -3.402598 -1.673758 0.51271
H  -4.175734 0.672624 0.043873
H  2.592821 0.780962 2.423542
H  3.199541 -1.627049 -0.667888
