program: Gaussian 09
title: 000176773
version: EM64L-G09RevD.01
frameworkgroup: C1[X(C20H14O2)]
method: RPBEPBE
basis: SDD
operation: Freq
keyword: #pfreq=noraman
keyword: PBEPBE/SDD
title: #p freq=noraman PBEPBE/SDD
converged: YES YES NO YES
title: Mulliken charges:
elementType: O O C C C C C C C C C C C C C C C C C C C C H H H H H H H H H H H H H H
charge: -0.453427 -0.432248 -0.201288 -0.006821 -0.263606 0.297005 0.207976 0.274255 0.162390 0.214448 0.197475 -0.443682 -0.434331 -0.414236 -0.401032 -0.383172 -0.222866 -0.386624 -0.235502 -0.233459 -0.237608 -0.257238 0.273252 0.282659 0.246674 0.357247 0.233320 0.247108 0.276257 0.224930 0.229743 0.366575 0.230934 0.228897 0.228502 0.227491
chargesum: 0.00000
title: Mulliken charges with hydrogens summed into heavy atoms:
elementType: O O C C C C C C C C C C C C C C C C C C C C
charge: -0.096180 -0.065673 -0.201288 -0.006821 0.009646 0.297005 0.207976 0.274255 0.162390 0.214448 0.197475 -0.161023 -0.187657 -0.180916 -0.153924 -0.106916 0.002064 -0.156881 -0.004568 -0.004562 -0.009106 -0.029746
polarizability: 3.29169859e+02 1.34186245e+00 2.53098151e+02 6.63252620e+00 2.00020280e+00 1.00743035e+02
1716.lowfreq: -2.4785 -0.0009 -0.0006 -0.0001 5.8870 7.3092 53.2972 85.0351 106.3892
frequency: 53.2842 85.0347 106.3888 120.8844 130.6055 160.6069 210.2169 229.7078 253.3065 263.5540 278.4730 293.3802 314.9775 331.2676 364.3635 379.1097 420.3793 432.5558 455.5250 475.4494 507.3127 519.5203 550.0399 556.8308 565.5933 612.7970 616.3352 621.7381 646.7685 659.4886 692.3514 732.7033 745.3333 754.3865 761.9260 774.6136 779.4098 799.8768 824.2225 836.2357 885.6806 888.7999 904.4740 924.1572 947.7602 959.7652 964.4630 971.9367 977.8519 992.4543 994.8337 997.6134 1023.0927 1030.6108 1050.3813 1062.1306 1077.9734 1103.4561 1133.2611 1166.4779 1171.8674 1177.6152 1182.2649 1193.5083 1204.2843 1219.4305 1248.5948 1258.3287 1275.8036 1289.1330 1310.5892 1315.9266 1363.7557 1370.6571 1374.9709 1406.5530 1422.2296 1437.9425 1450.0077 1462.2998 1470.4025 1497.3468 1573.9045 1589.6354 1601.6789 1612.8119 1617.5768 1620.9847 3026.1966 3124.2426 3126.4461 3127.9792 3135.9717 3139.1890 3143.6590 3151.6894 3153.6787 3159.8604 3165.1211 3167.4001 3488.5584 3580.4420
redmass: 5.6246 4.2914 5.1415 4.4808 4.5262 4.5436 2.8965 4.6508 5.0285 1.4734 3.8428 4.8098 5.4098 4.6158 5.2293 5.0896 4.7943 3.6881 3.8334 4.3568 4.6651 1.2536 3.7462 4.7267 4.1523 5.1799 4.6498 4.9867 6.8381 6.0171 3.9003 4.7014 2.7808 2.2429 2.1132 1.5171 1.7444 4.6511 2.7213 4.9946 1.4463 1.4187 1.4697 6.0030 3.9724 1.4461 1.6421 3.7088 1.3907 1.3584 1.3365 6.0735 2.1879 3.1311 2.2359 1.9756 2.7230 1.8461 1.7271 1.3667 1.1149 1.4229 2.0539 1.3843 1.3666 2.6965 1.3881 1.7637 1.7409 1.6140 2.3588 2.2564 5.1117 6.2520 1.3069 3.6753 2.6133 2.3516 2.7808 2.6811 4.2100 3.4834 6.4045 6.7065 7.0810 6.7599 7.5049 8.6979 1.0846 1.0852 1.0858 1.0857 1.0898 1.0906 1.0916 1.0940 1.0949 1.0984 1.0998 1.0995 1.0644 1.0666
irintensity: 1.3466 0.5258 0.9009 1.3322 0.1532 0.9995 9.8290 2.0020 2.3630 76.9912 9.9464 8.5558 2.7200 6.6011 5.5792 2.2942 1.2204 1.1685 2.8887 2.9859 6.2574 120.6419 1.6115 2.0604 10.2496 1.6805 17.5661 17.3356 0.6416 7.4891 35.4215 6.5007 1.7868 70.9372 107.6482 73.0961 9.4449 10.6822 6.8933 1.0508 0.7724 0.6564 0.2758 20.4769 14.4832 3.0427 3.0568 42.1636 2.2083 0.4406 0.7169 1.9654 8.6509 45.1117 18.8562 5.9913 24.0623 0.9489 2.6115 4.2448 3.1205 7.8453 7.6766 1.5640 16.7368 4.5246 9.6560 23.9737 5.3586 1.7389 11.1120 29.6769 3.9665 6.9625 47.7325 7.7439 26.1886 20.2159 14.8535 8.1483 2.2382 2.0424 2.7474 0.0797 11.6773 2.8388 1.5096 30.4699 7.9722 2.7095 2.6905 3.8430 11.4099 10.7189 6.1675 14.6545 22.0116 37.9092 38.4725 22.9978 24.5253 14.9940
temp: 298.150 k
press: 1.00000 atm
elementType: 8 8 6 6 6 6 6 6 6 6 6 6 6 6 6 6 6 6 6 6 6 6 1 1 1 1 1 1 1 1 1 1 1 1 1 1
symmnumber: 1
zpe: 732020.5 jmol-1
zpe.correction: 0.278812 hartree
zpe.thermalcorrener: 0.294983 hartree
zpe.thermalcorrenthalpy: 0.295927 hartree
zpe.thermalcorrgfe: 0.236474 hartree
zpe.sumelectzpe: -919.508339 hartree
zpe.sumelectthermal: -919.492168 hartree
zpe.sumelectthermalent: -919.491224 hartree
zpe.sumelectthermalfe: -919.550677 hartree
dipole: -1.2333 2.0507 0.7472
dipole: 2.5069
quadrupole: -107.1185 -117.6867 -130.2546
quadrupole: 1.4719 -0.5887 -2.5579
quadrupole: 11.2348 0.6666 -11.9014 1.4719 -0.5887 -2.5579
hfenergy: -919.7871507 hartree
pointgroup: C01 [X(C20H14O2)]
dipole: 0.4927522 -0.8005557 0.2984644 debye
polarizability: 329.1301179|1.9922206|253.0985068|-6.7796015|-2.9802738|100.7824203 unknown
InChI: InChI=1S/C20H14O2/c21-19-16-8-2-1-6-12(16)14-9-5-10-15-13-7-3-4-11-17(13)20(19,22)18(14)15/h1-11,19,21-22H
charge 0 multiplicity 1
36 atoms
O  0.057942 1.255056 1.670437
O  -0.561607 2.943192 -0.303257
C  0.388602 0.745597 0.298028
C  0.165596 -0.747936 0.15756
C  -0.636055 1.506406 -0.572613
C  1.891734 0.865935 0.03835
C  1.387493 -1.449804 0.027882
C  -1.097134 -1.350215 0.046098
C  2.475868 -0.439722 -0.039314
C  -2.055603 0.94013 -0.324626
C  -2.273889 -0.445559 -0.03024
C  2.688355 2.018947 -0.041753
C  1.363104 -2.855804 -0.089516
C  -1.114887 -2.770184 -0.068802
C  3.867875 -0.586816 -0.198461
C  -3.162104 1.80835 -0.435225
C  0.097399 -3.500493 -0.109559
C  -3.600505 -0.910267 0.153382
C  4.08986 1.86693 -0.209717
C  4.671415 0.577858 -0.282557
C  -4.48077 1.330978 -0.253709
C  -4.699659 -0.033194 0.043051
H  -0.368193 1.397185 -1.639448
H  2.230154 3.011163 0.009359
H  2.282399 -3.441795 -0.192795
H  0.703925 0.870028 2.314164
H  -2.064154 -3.307459 -0.16786
H  4.326937 -1.57939 -0.264042
H  -2.973344 2.863245 -0.658573
H  0.055661 -4.591838 -0.201081
H  -3.775614 -1.963553 0.400029
H  -0.565682 3.021318 0.689932
H  4.727724 2.75428 -0.286917
H  5.755494 0.480233 -0.409405
H  -5.328521 2.019806 -0.339286
H  -5.717617 -0.409408 0.193085
