program: Gaussian 09
title: 000176752
version: EM64L-G09RevD.01
frameworkgroup: C1[X(C11H8F3N3O)]
method: RPBEPBE
basis: SDD
operation: Freq
keyword: #p
keyword: freq=noraman
keyword: PBEPBE/SDD
title: #p freq=noraman PBEPBE/SDD
converged: YES YES NO NO
title: Mulliken charges:
elementType: F F F O N N N C C C C C C C C C C C H H H H H H H H
charge: -0.132202 -0.152891 -0.156973 -0.238461 -0.302672 -0.015078 -0.616327 0.194639 0.061206 0.475876 0.305296 -0.406590 -0.369614 -0.359230 0.165846 -0.205845 -0.212465 -0.237085 0.285064 0.268364 0.275005 0.235160 0.236738 0.236186 0.326133 0.339919
chargesum: 0.00000
title: Mulliken charges with hydrogens summed into heavy atoms:
elementType: F F F O N N N C C C C C C C C C C C
charge: -0.132202 -0.152891 -0.156973 -0.238461 -0.302672 -0.015078 0.049725 0.194639 0.061206 0.475876 0.305296 -0.121526 -0.101250 -0.084225 0.165846 0.029315 0.024273 -0.000899
polarizability: 2.20424532e+02 1.05324149e+01 1.35013144e+02 2.93759605e+00 -2.06696719e+01 8.11430771e+01
1716.lowfreq: -0.0003 0.0008 0.0009 2.7807 3.2802 6.3113 39.7137 48.2892 52.6584
frequency: 39.6579 48.2852 52.6493 67.2004 90.7129 131.9439 146.8562 163.3646 195.1541 259.8075 273.7874 292.1499 336.5505 372.1801 406.6940 422.7943 439.4725 468.7003 505.7433 514.0122 521.0677 563.1101 590.2994 611.5104 635.7963 652.6141 659.2607 692.7409 699.1642 724.0413 753.3903 768.8128 842.4103 857.1608 922.3145 936.3396 966.5350 974.4214 979.2927 991.0309 996.9647 1018.2828 1028.3211 1053.9028 1068.1082 1092.6102 1129.2944 1175.3816 1190.5079 1200.3917 1261.7379 1277.0587 1325.5272 1355.3536 1381.9035 1388.2198 1430.4641 1449.5526 1487.4359 1547.7276 1590.9832 1601.4748 1609.7193 1636.6524 3137.7635 3149.3992 3163.7417 3175.4900 3182.4706 3228.2719 3517.8967 3673.3054
redmass: 5.0791 5.4568 8.2309 8.3388 5.9084 10.7072 8.4318 6.2324 6.6887 8.0508 7.9825 7.1139 5.5570 8.8478 2.8674 6.4872 9.9740 7.6134 1.2055 4.0177 7.9380 3.0344 1.6059 6.4081 4.5862 6.4845 6.9727 2.0719 6.3390 6.5138 5.5870 1.6900 1.2515 1.4033 1.4249 8.6228 8.0955 1.9523 3.2262 6.3856 1.3511 4.3928 3.4096 1.9630 2.7712 1.9694 2.8696 1.0538 1.1642 1.8643 5.6488 7.0820 1.3401 4.6067 5.7073 9.8095 5.5058 2.4446 2.5670 7.0087 1.7022 6.7041 5.9419 2.9804 1.0857 1.0899 1.0944 1.0965 1.0992 1.0981 1.0449 1.1045
irintensity: 5.0049 0.7274 2.4263 4.1685 2.0187 0.7233 1.0891 4.4985 4.6634 1.1959 1.4170 2.3041 5.7421 1.0814 0.3551 1.4487 3.9428 3.5762 116.2337 6.6382 19.7055 51.4401 93.3790 0.0812 3.8821 4.3511 0.4499 39.4679 31.5281 9.2913 24.1284 73.0947 1.4078 17.7953 11.7316 87.8017 163.9605 56.2670 57.1228 7.2687 1.5964 42.9521 139.3440 3.9152 22.4633 6.2560 61.5216 0.0942 1.9043 24.8352 84.9384 98.4170 12.3991 203.4621 5.6897 4.6727 43.0752 21.9192 65.0535 63.6768 160.2022 4.4742 3.2969 272.5565 0.0800 12.8774 21.0289 5.7418 5.7603 0.0795 54.8515 28.8196
temp: 298.150 k
press: 1.00000 atm
elementType: 9 9 9 8 7 7 7 6 6 6 6 6 6 6 6 6 6 6 1 1 1 1 1 1 1 1
symmnumber: 1
zpe: 467111.5 jmol-1
zpe.correction: 0.177913 hartree
zpe.thermalcorrener: 0.193324 hartree
zpe.thermalcorrenthalpy: 0.194268 hartree
zpe.thermalcorrgfe: 0.134071 hartree
zpe.sumelectzpe: -961.688854 hartree
zpe.sumelectthermal: -961.673443 hartree
zpe.sumelectthermalent: -961.672499 hartree
zpe.sumelectthermalfe: -961.732696 hartree
dipole: 1.3738 -4.1006 1.9818
dipole: 4.7571
quadrupole: -81.2491 -101.4089 -104.7984
quadrupole: 17.1540 -8.8486 -6.2460
quadrupole: 14.5697 -5.5901 -8.9796 17.1540 -8.8486 -6.2460
hfenergy: -961.866767 hartree
pointgroup: C01 [X(C11H8F3N3O1)]
dipole: -0.4338977 1.1494018 1.4118991 debye
dipolederiv: -0.6471985 0.1969844 -0.0701101 0.2534908 -0.5135728 0.0116289 -0.1072966 0.0139666 -0.2655215 -0.5349261 -0.1748413 0.1848763 -0.1177086 -0.5493535 0.1172062 0.1753541 0.1053273 -0.4173715 -0.3413005 -0.0354362 -0.1016546 0.0118499 -0.5219609 -0.1763268 -0.1147935 -0.1836973 -0.715634 -0.8108995 0.078763 0.1521817 0.1170604 -0.4684119 -0.265702 0.0351447 -0.2397436 -0.8043774 -0.615337 -0.2011691 0.0239551 -0.1572399 0.0425925 -0.0266365 0.0129798 0.0236605 -0.0253578 -0.1403999 0.1075133 0.0216302 0.2771388 -0.211279 -0.0248799 0.2254821 0.0173143 -0.1731278 -0.9333122 -0.2458687 -0.4334187 -0.2247605 -0.7075517 -0.0308985 -0.3950176 -0.014055 -0.626664 0.5825216 0.0493587 -0.0488411 -0.0332135 -0.5360221 -0.1058419 -0.0399667 -0.1063878 -0.1682098 -0.7298985 0.0366167 0.0448266 -0.2427378 -0.0313692 -0.0083877 -0.0243299 -0.0211596 -0.0758723 0.7563139 0.1097762 -0.0171321 0.1927508 0.0435951 0.0314266 -0.0288226 -0.00895 0.1109914 1.5065269 0.0353793 -0.0068621 -0.1198312 1.8822142 0.0741422 0.0156399 0.0940922 1.4581234 -0.295362 -0.0479941 0.001878 0.1339172 0.1989989 0.0672355 -0.1206628 0.068945 -0.0771159 -0.1255914 0.0451436 0.0476522 0.0211069 -0.0615468 0.0705273 -0.0040598 0.0427304 -0.0511669 -0.1235365 -0.0370209 -0.0583123 -0.003123 -0.1001018 0.0330441 0.0010667 0.0292952 -0.065468 1.8562145 0.1306404 0.1832174 -0.0216451 0.5111809 0.5173145 0.2667357 0.4509872 1.1206171 -0.0127144 -0.0508301 -0.1086942 -0.0553382 -0.0881071 0.097229 -0.135523 0.0900954 0.0274032 -0.0598134 0.0714868 0.0665879 0.0706888 -0.0524599 0.1206945 0.1008194 0.1124964 0.0232341 0.0703942 0.0417859 -0.0057866 0.0371793 -0.1084801 0.0405724 -0.0176643 0.0477917 -0.0810018 0.0543992 -0.0449126 -0.003443 -0.0487304 0.0508667 -0.0269258 0.0033605 -0.0393276 0.1569134 0.095025 -0.0470735 -0.0511977 -0.0343682 0.1071467 -0.079426 -0.0636864 -0.062182 0.0649082 0.0800866 0.0069714 0.0725196 -0.0076802 0.1346877 -0.0501438 0.0791405 -0.0392262 0.065756 0.0038258 0.0268003 0.0825113 0.037206 0.1071617 -0.0853063 0.0998193 -0.0808906 0.0059206 0.0379182 -0.0461951 -0.0411307 -0.0656551 0.0830573 -0.1023482 -0.060992 -0.1029066 0.0088217 -0.1161322 -0.0440556 0.0076971 -0.0475879 0.1336734 -0.0319577 0.0065129 -0.02906 0.115193 0.238092 0.0231026 0.0391102 0.0427037 0.3274556 -0.0795364 0.076683 -0.0848167 0.1776174 0.2051041 0.0150744 0.0179395 -0.0154731 0.3275859 -0.0867036 0.0140769 -0.0842992 0.2113893 unknown
polarizability: 219.7424872|14.2550213|110.6985911|-7.958139|32.8151715|106.1396752 unknown
InChI: InChI=1S/C11H8F3N3O/c12-11(13,14)9-8(10(15)18)6-16-17(9)7-4-2-1-3-5-7/h1-6H,15H2
charge 0 multiplicity 1
26 atoms
F  2.017375 -2.125072 -0.221734
F  -0.178088 -2.151636 0.307611
F  0.464734 -1.814436 -1.843805
O  3.718957 -0.137033 -1.533776
N  -0.2532 0.761216 0.115329
N  0.135147 2.049498 0.477628
N  4.36158 0.991003 0.397256
C  0.851157 -0.025232 -0.222892
C  1.99416 0.791754 -0.092158
C  -1.665276 0.460235 0.114047
C  0.795619 -1.493212 -0.496518
C  1.491311 2.052215 0.35119
C  -2.46517 0.999379 1.147621
C  -2.237238 -0.304582 -0.927827
C  3.41017 0.483255 -0.476411
C  -3.852426 0.747125 1.146986
C  -3.625621 -0.555688 -0.911289
C  -4.436464 -0.035007 0.12298
H  2.043034 2.971467 0.538674
H  -1.998387 1.608035 1.926488
H  -1.620934 -0.685403 -1.747016
H  -4.475732 1.159446 1.947303
H  -4.072824 -1.149415 -1.71516
H  -5.513805 -0.231241 0.12787
H  4.109042 1.386893 1.301151
H  5.346278 0.857835 0.167551
