program: Gaussian 09
title: 000176756
version: EM64L-G09RevD.01
frameworkgroup: C1[X(C13H11ClF3N3O)]
method: RPBEPBE
basis: SDD
operation: Freq
keyword: #p
keyword: freq=noraman
keyword: PBEPBE/SDD
title: #p freq=noraman PBEPBE/SDD
converged: YES YES NO NO
title: Mulliken charges:
elementType: Cl F F F O N N N C C C C C C C C C C C C C H H H H H H H H H H H
charge: -0.042200 -0.130086 -0.152929 -0.154447 -0.248893 -0.306486 -0.014186 -0.368401 0.194884 0.044507 0.503984 -0.415432 0.297386 0.183598 -0.324954 -0.385876 -0.338404 -0.085846 -0.185764 -0.241835 -0.649647 0.285477 0.301649 0.274668 0.310403 0.220091 0.262057 0.240744 0.263167 0.235509 0.203283 0.223978
chargesum: 0.00000
title: Mulliken charges with hydrogens summed into heavy atoms:
elementType: Cl F F F O N N N C C C C C C C C C C C C C
charge: -0.042200 -0.130086 -0.152929 -0.154447 -0.248893 -0.306486 -0.014186 -0.057998 0.194884 0.044507 0.503984 -0.129955 0.297386 0.183598 -0.023305 -0.111207 0.143743 -0.085846 0.054980 0.021332 0.013123
polarizability: 2.79520648e+02 7.09512250e+00 1.70220330e+02 -1.22708991e+00 1.87959099e+01 1.00696950e+02
1716.lowfreq: -5.8287 0.0007 0.0013 0.0015 2.3040 4.9932 14.3735 26.1905 38.3143
frequency: 14.0324 26.1900 38.2862 40.5904 54.0432 69.5514 84.3598 114.9805 131.7802 143.8959 187.4560 196.5511 197.4560 230.3490 244.0349 271.8722 301.6233 317.6896 344.1795 373.4344 380.5328 401.4212 436.5753 440.7565 458.4156 475.0550 521.6857 550.3914 573.3059 601.2840 641.3858 649.5433 663.0828 681.3915 697.0957 741.2048 748.1096 762.0835 789.0287 830.4462 855.3068 887.8656 889.8936 907.2334 940.5685 966.4097 977.8058 978.7998 985.3943 1024.0784 1052.7421 1075.1898 1085.1561 1089.5670 1103.7714 1138.0367 1145.2131 1177.0654 1197.4569 1228.2827 1268.7020 1281.2342 1295.3480 1324.8005 1357.3139 1374.8998 1383.5676 1389.1837 1429.2000 1430.7697 1466.8608 1472.8624 1475.7106 1480.4639 1488.0205 1551.6202 1587.2955 1604.6066 1611.0911 2983.4084 2998.6276 3067.8066 3086.7053 3098.3091 3153.4927 3178.0368 3184.3865 3190.0348 3226.4795 3544.1839
redmass: 3.1790 4.6951 5.6606 5.6587 9.4852 13.3697 4.7884 4.7396 7.5003 9.2463 5.0268 6.1343 1.6654 4.8491 4.3056 9.8300 3.5347 5.5330 5.9622 8.7233 10.0055 4.0202 3.4462 8.5284 5.6279 7.3470 10.2731 6.2556 1.2338 5.7061 6.8006 12.5059 7.1941 2.5042 7.7953 2.9781 5.9791 2.7787 1.4214 2.2038 1.4027 1.4397 2.1138 1.3988 8.1515 12.1146 1.4907 3.8051 6.2772 7.2771 5.1835 2.2488 2.4291 2.1559 2.0438 2.0466 2.5208 1.0821 2.1947 2.3591 6.8977 1.1620 1.2928 3.9707 1.4185 4.2539 10.1509 1.2178 3.0211 5.0924 1.1439 1.0565 2.8235 1.1015 1.6973 8.1447 7.1949 6.8309 7.4214 1.0360 1.0657 1.0982 1.0976 1.1018 1.0882 1.0941 1.0935 1.0980 1.0981 1.0777
irintensity: 0.2295 0.9714 2.6720 0.7973 0.3597 0.4134 1.5113 2.1622 0.4432 3.0537 0.1710 5.0663 1.1677 3.0693 0.2388 0.7676 3.2378 9.2511 15.2695 4.7291 6.6229 0.0249 2.9720 1.7693 5.3799 1.8401 2.5024 1.9981 101.4837 0.5600 8.2843 6.9105 5.2997 21.6008 13.5448 9.2148 30.5569 16.3608 52.1324 37.6951 18.2186 30.2494 9.8449 1.6391 117.6156 172.5196 9.7550 53.3316 2.9591 221.8180 28.4539 24.1731 11.0138 14.6374 14.6720 22.8754 43.1358 0.5291 54.0464 94.6007 112.4152 47.5079 4.9489 59.2678 11.2386 33.9468 1.4441 16.3915 32.6821 27.3325 106.9682 6.2368 141.8845 16.7319 122.4297 113.6892 52.2039 50.2539 161.7503 30.0479 46.3755 11.7273 35.1933 32.4521 7.7932 2.6404 2.5714 2.9314 0.1703 20.7455
temp: 298.150 k
press: 1.00000 atm
elementType: 17 9 9 9 8 7 7 7 6 6 6 6 6 6 6 6 6 6 6 6 6 1 1 1 1 1 1 1 1 1 1 1
symmnumber: 1
zpe: 586864.1 jmol-1
zpe.correction: 0.223525 hartree
zpe.thermalcorrener: 0.243306 hartree
zpe.thermalcorrenthalpy: 0.244250 hartree
zpe.thermalcorrgfe: 0.171855 hartree
zpe.sumelectzpe: -1499.520396 hartree
zpe.sumelectthermal: -1499.500615 hartree
zpe.sumelectthermalent: -1499.499671 hartree
zpe.sumelectthermalfe: -1499.572066 hartree
dipole: 1.9533 5.7292 2.0771
dipole: 6.3995
quadrupole: -101.2315 -130.3348 -131.0583
quadrupole: 4.0430 2.1031 3.2490
quadrupole: 19.6434 -9.4599 -10.1834 4.0430 2.1031 3.2490
hfenergy: -1499.743921 hartree
pointgroup: C01 [X(C13H11Cl1F3N3O1)]
dipole: -0.6495987 2.1567075 -1.1250077 debye
polarizability: 278.0813512|-14.7765746|164.7704719|-4.2198929|-27.6701004|107.5861045 unknown
InChI: InChI=1S/C13H11ClF3N3O/c1-2-18-12(21)10-7-19-20(11(10)13(15,16)17)9-5-3-4-8(14)6-9/h3-7,18H,2H2,1H3
charge 0 multiplicity 1
32 atoms
Cl 5.110916 -1.842275 1.021438
F  -1.276903 -2.458161 -0.926148
F  0.863736 -1.969789 -1.462278
F  0.340335 -2.591788 0.657565
O  -3.111082 -1.372843 1.109387
N  0.605936 0.611499 -0.119208
N  0.04401 1.872913 0.070299
N  -4.000888 0.271904 -0.295133
C  -0.374161 -0.386384 -0.114528
C  -1.611306 0.252124 0.104607
C  2.03864 0.534623 -0.259415
C  -1.291142 1.640761 0.202845
C  -0.124225 -1.821313 -0.445922
C  -2.95422 -0.373087 0.346428
C  2.763231 -0.505504 0.366825
C  2.696941 1.556291 -0.981787
C  -5.407501 -0.130731 -0.116298
C  4.161647 -0.511944 0.22195
C  4.101217 1.519617 -1.097509
C  4.851612 0.480219 -0.500868
C  -6.242964 0.939701 0.616254
H  -1.959392 2.475494 0.406251
H  2.264916 -1.275467 0.960361
H  2.109621 2.360091 -1.431527
H  -3.784964 1.030893 -0.944592
H  -5.849134 -0.353525 -1.10664
H  -5.386673 -1.069836 0.4622
H  4.619968 2.30288 -1.658932
H  5.94068 0.445506 -0.591105
H  -5.830013 1.134325 1.621161
H  -6.265156 1.8938 0.057163
H  -7.285581 0.592006 0.732057
