program: Gaussian 09
title: 000176747
version: EM64L-G09RevD.01
frameworkgroup: C1[X(C13H12F3N3O)]
method: RPBEPBE
basis: SDD
operation: Freq
keyword: #p
keyword: freq=noraman
keyword: PBEPBE/SDD
title: #p freq=noraman PBEPBE/SDD
converged: YES YES NO NO
title: Mulliken charges:
elementType: F F F O N N N C C C C C C C C C C C C C H H H H H H H H H H H H
charge: -0.146707 -0.159110 -0.148263 -0.259173 -0.292151 -0.012913 -0.114139 0.169675 0.071433 0.467754 -0.399795 0.158404 0.280480 -0.366424 -0.371555 -0.608583 -0.610180 -0.211676 -0.206967 -0.239112 0.285667 0.274743 0.269986 0.225034 0.282477 0.230088 0.242323 0.255065 0.228851 0.235195 0.234322 0.235252
chargesum: 0.00000
title: Mulliken charges with hydrogens summed into heavy atoms:
elementType: F F F O N N N C C C C C C C C C C C C C
charge: -0.146707 -0.159110 -0.148263 -0.259173 -0.292151 -0.012913 -0.114139 0.169675 0.071433 0.467754 -0.114129 0.158404 0.280480 -0.091681 -0.101569 0.129016 0.116060 0.023519 0.027354 -0.003861
polarizability: 2.50449873e+02 -8.19878546e+00 1.43502028e+02 -6.51653536e+00 -1.09532130e+01 1.16347173e+02
1716.lowfreq: -1.6616 -0.0005 -0.0002 0.0006 3.6940 11.6061 29.1066 38.5729 41.8623
frequency: 29.0255 38.5410 41.8154 58.0047 71.3329 96.4817 118.1819 128.7440 142.7845 145.5665 154.9478 200.5817 233.0421 254.3795 270.2480 287.4193 328.6531 355.4874 370.9082 387.4625 407.0326 426.2716 443.2730 465.3749 507.7519 532.1606 573.1482 612.0607 639.2655 652.7986 662.7251 686.2764 693.8162 726.2969 733.4173 768.0009 842.5987 852.5427 886.5260 921.0081 934.2694 961.5199 975.0476 984.4866 990.8268 995.8062 1007.6521 1023.6362 1051.7482 1062.4998 1083.4852 1094.3549 1107.7134 1145.7712 1156.6777 1174.9048 1192.2207 1209.1764 1243.6725 1269.5161 1313.8138 1328.2256 1367.0616 1386.6240 1397.1135 1415.5510 1428.1645 1438.6258 1449.1496 1469.4008 1470.8523 1487.6663 1488.0204 1498.3498 1548.0519 1579.6980 1600.6359 1609.9309 2970.4597 2975.8618 3046.1833 3051.6829 3115.9418 3120.0093 3136.7866 3149.0015 3164.8371 3180.0502 3185.8446 3236.0157
redmass: 5.2791 6.0011 4.4029 10.0686 4.0526 5.4701 3.8992 3.1201 2.1505 2.0160 1.3015 5.2517 6.1886 6.7584 2.9691 8.3932 4.9869 5.0027 6.1223 4.3529 2.8753 5.4839 11.5258 6.2619 5.0771 7.6200 7.3689 6.4667 7.4660 8.9476 7.2221 5.4077 2.3357 6.8841 5.7081 1.6960 1.2528 1.4370 5.2442 1.4308 9.1121 8.2461 1.5269 3.9234 6.0896 1.4089 5.9602 2.6231 1.4013 2.6499 2.0485 1.2255 1.9997 1.4496 3.5138 1.0563 1.1288 1.8503 6.1237 7.8086 4.3695 1.4204 4.4977 9.0054 3.1210 1.1775 4.5566 1.3007 2.3739 1.0559 1.0469 2.0344 1.1708 1.3067 7.6403 6.2151 6.6844 6.0455 1.0362 1.0361 1.1014 1.1017 1.0966 1.0979 1.0857 1.0904 1.0956 1.0958 1.0977 1.0985
irintensity: 2.4745 3.3909 1.0889 0.4661 0.0536 1.9238 1.8331 0.0179 0.0873 0.0347 0.5013 0.8888 2.4605 0.3480 3.8539 1.7466 7.4042 6.5805 9.4498 6.6722 0.6217 1.2310 8.0999 7.0915 10.2849 6.2496 10.8688 0.5790 6.8392 8.1483 3.0412 4.0043 37.1229 2.7893 3.2894 72.0536 1.6416 20.1076 11.2379 16.6522 108.0759 168.0763 28.1579 111.7574 8.2478 1.6711 121.3267 27.3762 15.6455 16.6863 72.9917 0.6308 91.2479 10.2510 103.5061 0.4621 2.2720 19.8334 39.4122 93.2061 4.3396 1.6851 111.6652 1.5071 59.7086 42.6118 39.3251 16.4484 17.5813 12.0457 8.1541 50.0240 49.6941 13.8693 87.0127 301.8308 4.2913 16.8294 28.1895 95.7607 36.9102 23.6957 17.7601 1.1208 0.0841 14.8551 25.8330 3.1672 4.1169 0.0466
temp: 298.150 k
press: 1.00000 atm
elementType: 9 9 9 8 7 7 7 6 6 6 6 6 6 6 6 6 6 6 6 6 1 1 1 1 1 1 1 1 1 1 1 1
symmnumber: 1
zpe: 610218.4 jmol-1
zpe.correction: 0.232420 hartree
zpe.thermalcorrener: 0.251065 hartree
zpe.thermalcorrenthalpy: 0.252009 hartree
zpe.thermalcorrgfe: 0.184103 hartree
zpe.sumelectzpe: -1040.120928 hartree
zpe.sumelectthermal: -1040.102284 hartree
zpe.sumelectthermalent: -1040.101339 hartree
zpe.sumelectthermalfe: -1040.169245 hartree
dipole: -0.6041 -1.2016 4.0827
dipole: 4.2986
quadrupole: -91.2994 -115.9597 -120.7383
quadrupole: -4.1357 12.0431 -5.9326
quadrupole: 18.0330 -6.6272 -11.4058 -4.1357 12.0431 -5.9326
hfenergy: -1040.3533481 hartree
pointgroup: C01 [X(C13H12F3N3O1)]
dipole: -0.2517263 0.0023725 1.6723404 debye
polarizability: 250.8034366|-7.5809974|134.9730641|-2.5558172|-16.7329215|124.5225734 unknown
InChI: InChI=1S/C13H12F3N3O/c1-18(2)12(20)10-8-17-19(11(10)13(14,15)16)9-6-4-3-5-7-9/h3-8H,1-2H3
charge 0 multiplicity 1
32 atoms
F  1.609038 2.015533 -0.072866
F  -0.070486 1.913004 -1.583711
F  -0.54796 2.099545 0.626482
O  3.355897 -0.782035 -1.589458
N  -0.778566 -0.831143 0.037089
N  -0.410727 -2.160599 0.216598
N  3.734667 -0.117347 0.618922
C  0.352137 -0.020241 -0.141893
C  1.480976 -0.862814 -0.095322
C  -2.184744 -0.507725 0.086117
C  0.947585 -2.167992 0.121136
C  2.924565 -0.562788 -0.412478
C  0.328477 1.457998 -0.289952
C  -2.750083 0.42653 -0.811411
C  -2.9908 -1.192946 1.025545
C  5.145204 0.195118 0.33246
C  3.266031 0.17554 1.980888
C  -4.133536 0.697451 -0.739621
C  -4.372629 -0.919107 1.079437
C  -4.948316 0.030807 0.203223
H  1.489872 -3.107626 0.199131
H  -2.135205 0.920521 -1.567777
H  -2.530809 -1.930519 1.688276
H  5.812765 -0.403173 0.980662
H  5.34747 -0.043428 -0.722573
H  5.346246 1.269018 0.509287
H  3.266017 1.266087 2.171862
H  2.244457 -0.205302 2.128104
H  3.930667 -0.310056 2.72002
H  -4.574011 1.421717 -1.432738
H  -4.998516 -1.446263 1.807162
H  -6.021583 0.243336 0.250197
