program: Gaussian 09
title: 000176718
version: EM64L-G09RevD.01
frameworkgroup: C1[X(C20H16O6)]
method: RPBEPBE
basis: SDD
operation: Freq
keyword: #pfreq=noraman
keyword: PBEPBE/SDD
title: #p freq=noraman PBEPBE/SDD
converged: YES YES NO NO
title: Mulliken charges:
elementType: O O O O O O C C C C C C C C C C C C C C C C C C C C H H H H H H H H H H H H H H H H
charge: -0.298553 -0.298552 -0.207327 -0.207328 -0.178482 -0.178479 -0.047787 -0.047795 -0.348153 -0.348158 -0.315211 -0.315208 0.165369 0.165309 0.198188 0.198211 -0.183839 -0.183849 0.251806 0.251805 -0.375908 -0.375914 -0.376695 -0.376688 -0.228888 -0.228890 0.257337 0.257353 0.221146 0.233044 0.233044 0.221139 0.227978 0.218911 0.227986 0.218900 0.260125 0.260126 0.289312 0.289313 0.237652 0.237653
chargesum: 0.00000
title: Mulliken charges with hydrogens summed into heavy atoms:
elementType: O O O O O O C C C C C C C C C C C C C C C C C C C C
charge: -0.298553 -0.298552 -0.207327 -0.207328 -0.178482 -0.178479 0.209550 0.209557 0.106037 0.106025 0.131677 0.131678 0.165369 0.165309 0.198188 0.198211 -0.183839 -0.183849 0.251806 0.251805 -0.115783 -0.115788 -0.087383 -0.087375 0.008763 0.008763
polarizability: 3.18863056e+02 -5.71958103e-03 3.34364116e+02 1.83604110e-01 1.42840174e-02 1.21156477e+02
1716.lowfreq: -7.8371 -2.3306 -0.0005 -0.0004 0.0001 4.1811 12.9568 21.9306 26.0153
frequency: 12.8172 21.9181 26.0144 32.2840 36.0908 50.5352 71.4370 73.5760 109.7791 110.9295 115.2628 123.2980 169.4257 182.2167 202.5494 227.1596 239.8131 260.7287 290.8786 344.9477 346.6165 355.9267 387.8694 398.3048 406.2097 419.4716 423.8696 431.4412 454.8959 475.7402 499.6677 502.5049 570.8371 575.6830 614.5633 650.3210 668.0526 696.4712 724.2550 739.6625 748.3542 752.0655 761.4301 799.3462 799.7681 809.6243 819.2685 832.3145 837.9322 871.8211 896.7936 899.0984 902.8149 921.9060 931.7748 938.1143 971.7447 975.7477 992.9858 999.0355 1015.0954 1025.7720 1026.1529 1026.2536 1074.2379 1086.3876 1094.1732 1094.2020 1111.5066 1111.5450 1136.3498 1136.7268 1160.7647 1169.2579 1192.7623 1212.7469 1215.6227 1238.0317 1238.1946 1240.6881 1241.6709 1247.7958 1270.4420 1294.9057 1338.1663 1347.2153 1372.4503 1379.2085 1403.1470 1410.5626 1417.8291 1433.9329 1445.9910 1468.8874 1469.7814 1471.0440 1482.8547 1483.3674 1522.6431 1541.7911 1562.6241 1588.9608 1609.9390 1612.4851 2965.6262 2966.2110 3033.5657 3033.6410 3075.1454 3075.1478 3126.9202 3126.9290 3134.7281 3151.1762 3161.6696 3163.8829 3171.9187 3181.1127 3186.6671 3186.6822
redmass: 8.1781 8.6868 4.5573 4.4948 4.1304 6.7331 3.6044 5.3829 3.4914 4.4321 3.9647 5.5910 6.6341 5.9803 4.2738 7.1128 6.5600 5.9701 4.6572 8.7557 6.8558 5.2209 12.8573 3.5802 2.3919 3.3389 5.3785 3.1966 8.2587 7.3119 6.3119 4.4849 8.0433 3.4802 5.9220 6.8024 4.5064 6.8265 8.1670 2.0235 7.8824 5.2339 7.6084 3.8862 4.3567 1.6606 2.1999 7.3399 7.9977 2.6756 1.2068 1.2091 5.8670 5.6740 1.4999 2.0112 1.7636 1.6512 6.8996 1.3899 1.3590 2.2187 1.4261 1.5739 3.0827 2.5563 1.3904 1.3911 1.3339 1.3339 1.4841 1.4872 2.4603 1.0778 1.4469 1.3466 1.3480 1.5981 1.5778 2.3912 1.6962 3.9691 4.0765 2.8816 1.6250 1.3461 4.3149 5.8368 9.9076 1.9254 2.0108 2.5449 2.6481 1.1735 1.1927 2.6211 1.1911 1.2040 10.5458 6.3728 7.8137 7.1847 6.8035 7.6189 1.0551 1.0552 1.1075 1.1075 1.0535 1.0535 1.0922 1.0922 1.0863 1.0904 1.0867 1.0942 1.0997 1.0959 1.1191 1.1191
irintensity: 2.1230 0.0347 2.6787 0.1649 9.5716 0.0686 0.7963 2.3890 4.9345 0.0018 0.0452 4.6678 2.5970 14.6136 0.0137 0.1454 1.5130 1.3859 16.6878 6.9535 1.0158 0.1638 21.0244 10.1968 0.0080 1.0694 0.0001 0.9233 0.5869 1.4103 8.2426 0.0027 0.0208 15.9057 0.2804 12.5264 0.0277 6.9086 4.1461 43.7182 4.4920 0.0244 12.4010 33.8320 46.8372 84.2665 2.0411 19.6484 0.8074 0.0004 0.1101 14.6169 0.6290 130.4644 19.4249 0.2878 5.9559 36.4094 255.8221 3.9529 0.0052 2.4936 0.2536 0.8717 0.5989 1.2851 1.6215 7.4371 8.5727 17.5336 1.4671 1.5823 26.0476 7.8466 54.8263 62.2688 2.2946 12.7412 18.8364 345.8716 37.6266 130.8848 697.3403 9.1093 0.4844 19.2054 1.9651 64.4159 4.2739 16.8473 2.1638 12.4809 60.4290 0.8022 13.7403 1.5066 0.2926 7.1363 22.0397 443.5853 6.2623 16.1888 1.4438 34.2757 4.3842 79.3473 0.1491 51.4585 16.5473 24.7761 10.9846 7.7922 4.3294 9.4655 10.1921 1.8214 34.7785 8.5700 43.6171 6.3190
temp: 298.150 k
press: 1.00000 atm
elementType: 8 8 8 8 8 8 6 6 6 6 6 6 6 6 6 6 6 6 6 6 6 6 6 6 6 6 1 1 1 1 1 1 1 1 1 1 1 1 1 1 1 1
symmnumber: 1
zpe: 821063.8 jmol-1
zpe.correction: 0.312727 hartree
zpe.thermalcorrener: 0.335694 hartree
zpe.thermalcorrenthalpy: 0.336638 hartree
zpe.thermalcorrgfe: 0.255875 hartree
zpe.sumelectzpe: -1221.099617 hartree
zpe.sumelectthermal: -1221.076650 hartree
zpe.sumelectthermalent: -1221.075706 hartree
zpe.sumelectthermalfe: -1221.156468 hartree
dipole: -0.0001 0.1118 0.0032
dipole: 0.1119
quadrupole: -166.4441 -137.9326 -146.3279
quadrupole: -0.0038 -8.6688 0.0104
quadrupole: -16.2092 12.3023 3.9070 -0.0038 -8.6688 0.0104
hfenergy: -1221.4123436 hartree
pointgroup: C01 [X(C20H16O6)]
dipole: -0.0000903 0.0439903 0.0012418 debye
polarizability: 318.8217512|-0.0110054|334.3641108|2.8634653|0.005461|121.1977874 unknown
InChI: InChI=1S/C20H16O6/c21-19-13-3-1-2-4-14(13)20(22)18-16(26-10-12-8-24-12)6-5-15(17(18)19)25-9-11-7-23-11/h1-6,11-12H,7-10H2
charge 0 multiplicity 1
42 atoms
O  5.920767 -3.145972 0.192004
O  -5.918275 -3.150414 -0.191729
O  2.808931 -1.05751 0.2153
O  -2.807972 -1.059687 -0.216084
O  2.745666 1.523179 0.266109
O  -2.74656 1.520909 -0.269383
C  4.988092 -1.986738 0.453045
C  -4.986489 -1.990546 -0.453123
C  5.88843 -1.949018 -0.73815
C  -5.886656 -1.953285 0.738219
C  3.525723 -2.346112 0.310685
C  -3.523832 -2.348834 -0.310967
C  0.719884 0.177232 0.061553
C  -0.719831 0.176647 -0.063171
C  1.421445 -1.075655 0.113043
C  -1.420462 -1.07678 -0.114071
C  1.480892 1.470001 0.138991
C  -1.481843 1.468782 -0.141284
C  0.704295 2.746552 0.067344
C  -0.706405 2.745974 -0.068585
C  0.698032 -2.292688 0.054476
C  -0.696143 -2.293243 -0.055138
C  1.405332 3.9776 0.13568
C  -1.408546 3.976435 -0.136181
C  0.704376 5.196347 0.068625
C  -0.708688 5.195764 -0.068297
H  5.243882 -1.379517 1.32919
H  -5.242864 -1.383649 -1.329321
H  5.471203 -2.151544 -1.732238
H  6.785647 -1.320896 -0.710348
H  -6.784336 -1.325824 0.710467
H  -5.469113 -2.155345 1.73227
H  3.175691 -2.913025 1.19707
H  3.366264 -2.957165 -0.60011
H  -3.173572 -2.915713 -1.197282
H  -3.363739 -2.959546 0.599949
H  1.221102 -3.251371 0.09173
H  -1.218496 -3.252332 -0.092098
H  2.494081 3.944519 0.240469
H  -2.497255 3.942454 -0.241113
H  1.248404 6.145574 0.121777
H  -1.253562 6.14454 -0.120823
