program: Gaussian 09
title: 000176699
version: EM64L-G09RevD.01
frameworkgroup: C1[X(C13H21N3O4)]
method: RPBEPBE
basis: SDD
operation: Freq
keyword: #p
keyword: freq=noraman
keyword: PBEPBE/SDD
title: #p freq=noraman PBEPBE/SDD
converged: YES YES NO NO
title: Mulliken charges:
elementType: O O O O N N N C C C C C C C C C C C C C H H H H H H H H H H H H H H H H H H H H H
charge: -0.259498 -0.224087 -0.244452 -0.234662 -0.250112 -0.157635 -0.092177 -0.021624 -0.154077 0.373020 0.138004 0.142336 -0.705475 -0.783761 0.245085 -0.775737 -0.614329 -0.352203 -0.512523 -0.501433 0.287786 0.242732 0.229828 0.229011 0.267377 0.249979 0.226960 0.228757 0.244170 0.246604 0.234608 0.266425 0.229902 0.218439 0.223607 0.240900 0.233250 0.245902 0.196900 0.241847 0.200352
chargesum: 0.00000
title: Mulliken charges with hydrogens summed into heavy atoms:
elementType: O O O O N N N C C C C C C C C C C C C C
charge: -0.259498 -0.224087 -0.244452 -0.234662 -0.250112 -0.157635 -0.092177 -0.021624 0.133709 0.373020 0.138004 0.142336 -0.003904 -0.039445 0.245085 -0.056206 0.116607 0.089844 0.207530 0.137667
polarizability: 1.72210368e+02 -1.74999731e+00 1.81955636e+02 8.62054873e+00 -2.89444973e+00 1.64379336e+02
1716.lowfreq: -3.1298 -0.0003 0.0002 0.0003 4.9151 8.0033 31.2644 35.5987 36.7967
frequency: 30.1420 35.5736 36.7931 48.1002 53.0219 58.9384 64.4776 67.2851 82.9763 102.5263 104.0256 115.1498 143.5746 146.8479 168.9983 179.4309 182.7117 204.6094 221.5311 233.0091 237.5453 254.2257 264.0469 273.6082 318.4882 321.8866 342.6733 368.8968 376.5389 418.8841 443.4778 537.9400 548.4491 581.7317 595.7942 625.2045 631.0319 653.3515 703.7205 727.0425 752.7739 803.1950 829.5361 884.9096 926.5626 938.8260 964.8663 969.3134 989.6434 1020.9733 1022.7988 1044.5367 1046.6412 1049.4892 1086.4494 1094.3531 1111.9699 1114.5282 1115.0082 1120.5397 1148.3010 1151.1568 1156.7179 1168.9278 1197.6262 1230.3557 1239.1302 1273.2931 1340.8184 1349.3572 1365.1875 1372.2837 1392.2318 1400.5328 1403.0219 1420.5020 1423.9880 1431.6921 1448.4096 1450.6487 1454.2158 1458.5509 1459.7932 1462.1494 1466.4588 1468.9267 1472.4124 1473.9134 1474.1300 1482.5658 1484.4259 1488.2063 1498.5994 1562.0922 1622.2566 1635.6850 2908.6075 2922.7577 2953.2807 2974.2528 2987.0176 2988.7062 2992.6130 3000.0021 3001.8491 3024.9276 3050.7183 3064.7768 3071.3614 3091.7632 3096.6230 3101.5949 3102.1155 3108.6683 3110.3223 3132.6470 3150.5021
redmass: 4.4193 6.7616 2.8097 3.3056 2.1884 1.4433 3.5247 1.1406 2.4957 1.2570 3.0299 2.6383 3.2084 1.9073 1.5678 3.1713 2.8393 3.5262 3.2078 1.1656 1.0790 3.5496 2.8300 2.9008 5.0763 4.1950 5.8208 4.7620 4.8323 5.7084 4.7732 4.1004 3.2409 4.1872 3.8314 5.0168 5.9251 4.8396 5.6616 5.2284 5.9370 3.4269 3.7098 4.7297 6.2227 2.5038 3.6724 2.4197 1.9454 1.8389 1.9366 1.5619 2.0895 1.5089 3.9825 2.5843 1.3869 1.5567 1.8218 1.3143 1.5244 1.7650 2.4463 3.0297 1.0994 4.0809 2.9328 3.4776 1.5142 1.7700 2.0175 2.8335 1.2185 1.2153 1.2463 1.1950 1.4747 1.1167 1.1372 1.2215 1.0840 1.0518 1.1119 1.0540 1.0609 1.1960 1.1024 1.0771 1.0765 1.0735 1.1075 3.9310 1.8305 6.2387 10.2834 8.8134 1.0523 1.0375 1.1010 1.0377 1.0374 1.0362 1.1025 1.0354 1.0300 1.0831 1.0980 1.0975 1.1013 1.0977 1.0992 1.1039 1.0986 1.0965 1.1013 1.0985 1.1046
irintensity: 0.4997 2.2808 0.3554 0.5390 6.9901 0.0011 5.7537 0.1712 0.6998 0.8058 0.4541 0.9814 3.4226 0.8576 0.0533 6.0611 6.4693 8.2318 3.4402 3.9969 1.0007 4.7869 1.4690 1.5197 10.5163 2.4887 4.4563 2.4983 1.7507 5.3282 7.3353 3.6444 0.8001 3.0661 15.7643 11.2013 4.0015 10.0801 6.0552 2.7108 2.7254 12.0954 3.5780 23.5575 17.8529 8.7432 12.3158 11.4316 0.3531 6.1666 0.8054 4.3310 25.8076 13.5947 73.3862 145.5205 12.5253 22.7707 30.7808 1.1488 8.7144 83.3005 70.0664 27.5078 2.9805 150.8946 53.3904 22.9040 10.1197 21.8545 11.6608 28.9661 20.4934 25.5234 3.0262 18.9171 0.7601 3.4583 22.5266 14.5980 25.4493 13.4483 7.8545 12.1743 19.6322 1.0188 9.4453 14.1424 21.4572 6.9403 32.2449 23.4111 8.7834 19.5555 293.4002 114.7140 67.8293 72.9660 38.6277 23.6622 34.3807 39.8947 71.2855 18.2673 31.5521 24.2774 16.5056 19.6204 21.7652 8.3200 32.2651 32.6822 7.8420 30.1582 12.8555 3.2076 12.2086
temp: 298.150 k
press: 1.00000 atm
elementType: 8 8 8 8 7 7 7 6 6 6 6 6 6 6 6 6 6 6 6 6 1 1 1 1 1 1 1 1 1 1 1 1 1 1 1 1 1 1 1 1 1
symmnumber: 1
zpe: 870611.3 jmol-1
zpe.correction: 0.331598 hartree
zpe.thermalcorrener: 0.355532 hartree
zpe.thermalcorrenthalpy: 0.356477 hartree
zpe.thermalcorrgfe: 0.275982 hartree
zpe.sumelectzpe: -971.543876 hartree
zpe.sumelectthermal: -971.519942 hartree
zpe.sumelectthermalent: -971.518998 hartree
zpe.sumelectthermalfe: -971.599493 hartree
dipole: -0.6012 3.8136 -3.7634
dipole: 5.3915
quadrupole: -110.6884 -133.9122 -105.0885
quadrupole: 9.2513 3.0787 -5.7557
quadrupole: 5.8747 -17.3492 11.4745 9.2513 3.0787 -5.7557
hfenergy: -971.8754744 hartree
pointgroup: C01 [X(C13H21N3O4)]
dipole: 0.6997392 -1.0153275 1.7259332 debye
polarizability: 174.3541311|-4.9857441|176.4868479|-3.9601637|-10.0879761|167.7043612 unknown
InChI: InChI=1S/C13H21N3O4/c1-8-12(9(2)15(4)14-8)16(11(17)7-19-5)10(3)13(18)20-6/h10H,7H2,1-6H3
charge 0 multiplicity 1
41 atoms
O  -3.077172 0.030778 0.696126
O  -1.036988 2.587271 -1.058295
O  1.172551 3.711326 0.035003
O  -2.525691 -2.117937 -0.006892
N  -0.346832 0.394111 -0.618276
N  1.913922 -1.88504 1.05271
N  2.567213 -1.828165 -0.18598
C  0.678331 -0.506175 -0.184357
C  -1.613491 -0.134471 -1.214281
C  0.779112 -1.099044 1.095549
C  1.801884 -0.985704 -0.943796
C  -0.176056 1.79604 -0.592754
C  -1.374496 -1.035464 -2.435622
C  -0.093851 -0.964197 2.306695
C  -2.427407 -0.876988 -0.14232
C  2.194358 -0.677977 -2.362024
C  2.481287 -2.715759 2.114032
C  1.14211 2.261502 0.051426
C  -3.923642 -0.561151 1.760508
C  2.416413 4.223357 0.607647
H  -2.177922 0.773619 -1.497801
H  -0.81541 -1.945393 -2.160777
H  -2.341027 -1.351984 -2.865366
H  -0.816766 -0.477011 -3.206037
H  -0.802371 -0.132591 2.155895
H  -0.684013 -1.883162 2.486558
H  0.494185 -0.75568 3.219694
H  2.045937 0.390348 -2.602431
H  3.254887 -0.9338 -2.520297
H  1.592732 -1.260578 -3.083262
H  1.739265 -3.444348 2.485024
H  3.33534 -3.256384 1.681164
H  2.835408 -2.101334 2.961908
H  1.204295 1.867006 1.091604
H  2.005454 1.834896 -0.5075
H  -4.380444 0.301203 2.2651
H  -3.307527 -1.15204 2.45994
H  -4.691011 -1.216696 1.315756
H  2.537795 3.918422 1.669983
H  2.34647 5.320313 0.548757
H  3.30517 3.879081 0.035388
