program: Gaussian 09
title: 000176695
version: EM64L-G09RevD.01
frameworkgroup: C1[X(C16H22N2O4)]
method: RPBEPBE
basis: SDD
operation: Freq
keyword: #p
keyword: freq=noraman
keyword: PBEPBE/SDD
title: #p freq=noraman PBEPBE/SDD
converged: YES YES NO NO
title: Mulliken charges:
elementType: O O O O N N C C C C C C C C C C C C C C C C H H H H H H H H H H H H H H H H H H H H H H
charge: -0.259666 -0.271164 -0.245814 -0.221149 -0.280219 -0.029559 -0.177738 0.130915 0.434433 0.017759 0.221604 -0.732912 -0.453063 0.274325 -0.606798 0.140703 -0.843827 -0.801349 -0.786653 0.243843 -0.765129 -0.502884 0.272830 0.247273 0.245612 0.245255 0.241660 0.240221 0.276827 0.227114 0.236386 0.304678 0.246314 0.231640 0.291725 0.255215 0.227516 0.229655 0.289393 0.248434 0.232740 0.233201 0.251441 0.239210
chargesum: 0.00000
title: Mulliken charges with hydrogens summed into heavy atoms:
elementType: O O O O N N C C C C C C C C C C C C C C C C
charge: -0.259666 -0.271164 -0.245814 -0.221149 -0.280219 -0.029559 0.095092 0.130915 0.434433 0.017759 0.221604 0.005228 -0.211402 0.274325 -0.089750 0.140703 -0.075649 -0.031671 -0.074267 0.243843 0.005438 0.220967
polarizability: 2.48369302e+02 1.11969670e+01 1.83477681e+02 -7.44512296e+00 8.91712526e+00 1.72413394e+02
1716.lowfreq: -50.3830 -8.9140 -6.2291 -0.0006 0.0001 0.0004 3.9151 31.4525 36.1793
frequency: -50.3266 31.1132 36.0900 39.7775 50.7388 59.1717 68.0086 89.2271 96.7266 102.8132 111.8118 123.4124 139.8173 150.4469 173.0632 181.2820 186.7937 193.8942 196.8528 224.2838 231.3826 250.7813 273.7687 279.3265 284.0080 319.1228 333.4221 375.8820 383.8131 400.1941 412.9583 485.4949 502.8943 506.7170 537.2137 549.1910 561.1601 580.5383 587.4121 615.7881 647.6860 663.5170 685.9074 742.1730 767.6428 801.9291 811.3042 883.2387 898.6904 912.1067 913.1760 935.4639 949.1757 951.4809 1010.9110 1015.5694 1028.4956 1029.4195 1038.4312 1042.7048 1046.7409 1052.4409 1055.0421 1099.9745 1103.2436 1115.3540 1136.1054 1142.9103 1151.7547 1185.1994 1216.7057 1243.2557 1252.1606 1298.8264 1301.7800 1330.4309 1344.6531 1350.7122 1369.2048 1369.8784 1390.3936 1396.0317 1406.1757 1409.4213 1421.5435 1424.8626 1437.8006 1447.3506 1452.9101 1454.0325 1458.3972 1464.4132 1467.1537 1468.2143 1469.4070 1473.5095 1476.0391 1482.1222 1483.3549 1548.2953 1562.9852 1584.0610 1631.0841 1645.5844 2968.5894 2973.2999 2974.8167 2983.8642 3002.6139 3006.0306 3020.2316 3028.5058 3057.2029 3057.8877 3061.5615 3062.2239 3093.7599 3101.6470 3108.9579 3110.1997 3112.8168 3117.7033 3117.9709 3126.6077 3133.6388 3151.2117
redmass: 1.0176 3.1491 4.5176 5.3047 3.6620 4.0307 4.4933 3.7616 2.7707 1.4575 1.5390 2.5939 3.1536 3.9889 1.2654 2.7218 1.0771 3.0298 3.3941 3.8319 3.7958 1.3827 2.2735 2.4477 3.3485 3.8248 3.6198 5.8371 4.9744 2.7499 3.1131 3.9170 3.9296 3.6089 3.5174 3.4823 4.3562 4.5974 4.1258 4.3510 3.9422 4.6383 5.2543 4.4601 4.0952 3.7171 3.7002 1.3141 1.8251 3.3999 3.3438 2.8700 3.4073 3.3529 1.8697 1.6639 1.9701 1.8970 1.6445 1.7638 1.7461 1.6122 1.5737 2.3499 2.5345 1.3339 1.6860 2.5131 1.5010 1.8967 3.0138 1.9394 1.6545 2.9345 2.5483 4.1595 1.4642 3.5979 2.3028 1.8619 1.3187 1.2022 1.2558 1.2755 1.2391 2.4797 1.0895 1.0665 1.0503 1.0831 1.1452 1.0507 1.0841 1.0623 1.0487 1.0666 1.0602 1.1176 1.1475 5.2806 8.4071 6.0139 7.3960 8.6660 1.0422 1.0437 1.0372 1.0382 1.0353 1.0294 1.0845 1.0598 1.0919 1.0947 1.0971 1.0889 1.1000 1.0999 1.1009 1.1047 1.1021 1.1003 1.0991 1.1005 1.0925 1.1050
irintensity: 0.3619 0.6066 2.5189 2.7901 1.8617 0.9879 2.5899 7.5024 2.3753 0.3221 0.2731 0.7966 0.0601 1.7613 2.2742 5.2584 1.0678 5.9248 1.3821 2.4508 5.1905 4.4430 3.4924 3.2973 4.2794 14.3608 5.8718 15.5463 16.1850 3.5723 0.9395 6.6313 6.2435 8.3731 3.1049 1.3317 1.7305 0.4166 6.4300 1.0120 6.9358 13.5753 9.7166 3.9111 0.1678 4.1605 5.4899 8.0560 1.1664 4.0482 7.0223 20.4250 3.3888 3.5296 2.5145 0.8383 9.2587 7.5113 11.9275 5.2638 15.0045 5.7770 15.2943 89.2386 18.7606 2.9602 58.1458 198.6127 46.6191 17.3888 238.4207 34.5632 46.7864 18.9268 8.4959 108.2090 13.9572 94.6019 27.0517 60.0753 26.4654 14.9851 43.9287 9.3997 7.1161 58.1020 10.7146 32.2038 15.0821 20.6134 22.0390 11.2813 6.3245 12.6321 11.2191 34.6463 26.9285 31.0077 35.7987 18.3330 278.2899 102.9677 96.4475 151.0753 18.1307 16.0677 7.5622 22.3180 12.6328 37.6533 5.4790 4.5376 7.5090 10.6511 16.4158 16.7098 21.1253 22.1081 11.8193 21.9337 5.2126 3.5898 12.7688 12.2557 13.9238 16.6189
temp: 298.150 k
press: 1.00000 atm
elementType: 8 8 8 8 7 7 6 6 6 6 6 6 6 6 6 6 6 6 6 6 6 6 1 1 1 1 1 1 1 1 1 1 1 1 1 1 1 1 1 1 1 1 1 1
symmnumber: 1
zpe: 929787.2 jmol-1
zpe.correction: 0.354137 hartree
zpe.thermalcorrener: 0.378259 hartree
zpe.thermalcorrenthalpy: 0.379203 hartree
zpe.thermalcorrgfe: 0.299660 hartree
zpe.sumelectzpe: -1031.652252 hartree
zpe.sumelectthermal: -1031.628130 hartree
zpe.sumelectthermalent: -1031.627186 hartree
zpe.sumelectthermalfe: -1031.706729 hartree
dipole: 0.2205 -0.9319 1.4249
dipole: 1.7168
quadrupole: -119.3494 -132.2956 -129.1839
quadrupole: -2.0164 -3.6176 -12.5691
quadrupole: 7.5936 -5.3526 -2.2409 -2.0164 -3.6176 -12.5691
hfenergy: -1032.0063893 hartree
pointgroup: C01 [X(C16H22N2O4)]
dipole: -0.1686683 0.4392917 0.4845325 debye
polarizability: 243.4332395|20.6148896|184.278385|10.5309087|-8.3338908|176.5487526 unknown
InChI: InChI=1S/C16H22N2O4/c1-9-7-10(2)17-12(4)15(9)18(13(5)16(21)22-6)14(20)8-11(3)19/h7,13H,8H2,1-6H3
charge 0 multiplicity 1
44 atoms
O  -3.713266 1.195847 0.333338
O  -1.91501 -1.478493 -0.137903
O  -2.422812 1.253674 -1.604266
O  1.202679 -3.383833 1.228221
N  -0.272091 0.13654 0.100296
N  2.920474 1.602156 -1.238408
C  -1.345693 1.032348 0.639474
C  1.108288 0.580823 0.035336
C  1.941805 0.463543 1.187058
C  1.632657 1.135977 -1.16815
C  -0.689193 -1.146517 -0.237568
C  -0.840561 2.453474 0.964072
C  3.264811 0.948112 1.0796
C  -2.512896 1.133511 -0.362476
C  0.366913 -2.158633 -0.706097
C  3.722997 1.519845 -0.133538
C  1.456396 -0.20285 2.455769
C  0.828495 1.205561 -2.447039
C  5.129381 2.066632 -0.267626
C  0.388607 -3.358035 0.266099
C  -0.639955 -4.440964 0.021549
C  -4.932126 1.316606 -0.502801
H  -1.766244 0.56401 1.548672
H  -0.452795 2.959774 0.064267
H  -1.682994 3.043263 1.364192
H  -0.043153 2.432015 1.724961
H  3.942831 0.877723 1.937513
H  0.062255 -2.497615 -1.711938
H  1.37135 -1.712019 -0.749448
H  2.101974 0.055212 3.312058
H  0.417363 0.074536 2.704677
H  1.477461 -1.304234 2.332349
H  1.25414 1.985497 -3.097541
H  0.900467 0.244357 -2.994988
H  -0.24395 1.391482 -2.271558
H  5.275745 2.45963 -1.285222
H  5.31489 2.879908 0.458724
H  5.884296 1.280862 -0.07771
H  -1.63907 -3.966872 -0.036057
H  -0.612355 -5.197059 0.820632
H  -0.459446 -4.926572 -0.956768
H  -5.759514 1.391525 0.216224
H  -5.035222 0.420455 -1.136604
H  -4.873128 2.213197 -1.142676
