program: Gaussian 09
title: 000176678
version: EM64L-G09RevD.01
frameworkgroup: C1[X(C20H22N2O2)]
method: RPBEPBE
basis: SDD
operation: Freq
keyword: #p
keyword: freq=noraman
keyword: PBEPBE/SDD
title: #p freq=noraman PBEPBE/SDD
converged: YES YES NO NO
title: Mulliken charges:
elementType: O O N N C C C C C C C C C C C C C C C C C C C C H H H H H H H H H H H H H H H H H H H H H H
charge: -0.221484 -0.261822 -0.427736 -0.057051 0.168690 -0.288822 0.213795 0.502743 -0.383583 0.165939 -0.752093 -0.742880 0.073717 -0.704341 -0.371079 -0.403314 0.188058 -0.330620 -0.244405 -0.242402 -0.377304 -0.249377 -0.269859 -0.194318 0.227996 0.319092 0.230583 0.216117 0.216162 0.235426 0.243359 0.217820 0.273332 0.207662 0.222961 0.243105 0.203283 0.235730 0.235844 0.284813 0.225828 0.222096 0.256190 0.227129 0.232056 0.232964
chargesum: 0.00000
title: Mulliken charges with hydrogens summed into heavy atoms:
elementType: O O N N C C C C C C C C C C C C C C C C C C C C
charge: -0.221484 -0.261822 -0.108644 -0.057051 0.168690 -0.060825 0.213795 0.502743 0.063117 0.165939 -0.057146 -0.044066 0.073717 -0.034992 -0.135349 -0.167470 0.188058 -0.045807 -0.018577 -0.020306 -0.121114 -0.022248 -0.037803 0.038646
polarizability: 2.17030407e+02 2.62640560e+01 2.55808894e+02 -2.46229255e+01 2.08777890e+01 1.94139268e+02
1716.lowfreq: -7.5362 -0.0003 0.0006 0.0008 5.5991 7.0110 18.1384 21.6076 29.4572
frequency: 16.7490 21.4623 29.4266 40.0664 59.1554 73.8814 80.9639 113.6922 128.7455 144.0773 163.3432 188.9128 212.0770 216.3902 233.2117 261.9127 263.8827 292.4970 304.1473 311.1398 326.7664 339.1571 345.6240 402.2278 403.1724 412.9019 429.8687 448.5368 505.2685 510.8141 532.1981 546.3324 554.6837 561.0357 592.6070 617.3773 640.2141 645.1459 695.5854 703.0968 717.1000 744.1538 759.4796 768.4990 770.2731 773.9266 800.2788 815.2986 850.4445 855.4231 867.1743 873.4037 900.9478 915.1031 926.7443 931.9389 956.4626 966.2766 976.2319 990.3582 990.6217 994.6366 1008.9667 1010.9048 1026.8998 1044.3341 1066.7453 1084.7387 1091.1415 1106.8867 1117.4455 1129.1558 1163.3629 1168.9707 1173.5746 1187.4160 1194.9813 1197.8286 1219.9731 1241.2981 1252.9029 1260.5088 1276.5000 1319.7554 1321.7101 1337.9167 1370.2150 1374.2345 1380.2249 1389.7687 1392.6045 1395.2345 1411.5428 1435.8282 1456.1869 1461.8073 1463.0894 1465.6938 1472.4705 1475.5213 1477.3878 1484.5530 1487.9076 1489.7095 1496.6669 1592.9361 1595.4880 1613.1114 1614.9853 1623.4038 2977.5986 2979.6674 2991.5097 2995.5400 3004.7491 3057.9372 3072.3079 3078.3599 3087.2471 3089.8807 3100.0778 3114.8924 3118.1987 3126.1371 3138.3673 3139.3602 3153.1264 3154.9127 3165.4019 3171.3174 3181.5666 3521.0860
redmass: 4.4265 6.0385 5.3124 4.2491 4.8707 3.9834 3.0691 4.4554 2.7720 3.3035 3.9910 2.6163 2.5287 4.8776 1.8149 1.3077 2.4893 2.9128 2.8372 1.5931 2.2016 3.6755 2.7924 2.9313 4.6115 3.3462 3.1600 6.1896 3.5037 4.4070 1.7002 4.1441 2.9965 2.4309 5.3715 6.4041 4.0466 4.9425 4.5510 1.6822 4.1559 5.6848 1.8506 2.7167 2.0437 2.3249 4.3113 2.6841 1.2551 6.4361 1.3991 2.8605 3.0967 1.5719 1.9188 1.4456 1.3717 2.1626 1.3959 1.6888 2.6781 1.3814 2.1324 1.3605 2.4018 2.6020 2.9137 1.6587 1.7713 2.0661 2.5571 1.6325 1.4191 2.4520 1.0789 2.3964 1.1542 2.0836 2.2471 1.7301 2.1955 1.6779 1.4970 1.3392 1.3851 1.3990 3.0915 1.2193 7.3422 1.2799 1.2370 2.9556 5.6748 2.2137 1.0870 1.5738 2.3367 1.0796 2.7908 1.1430 1.1687 1.8675 1.0701 1.2358 1.0887 6.1129 7.3747 6.3228 7.2585 6.5783 1.0365 1.0364 1.0823 1.0357 1.0620 1.0994 1.1001 1.0994 1.0995 1.1012 1.0984 1.1006 1.0853 1.0871 1.0867 1.0928 1.0950 1.0911 1.1000 1.0973 1.0982 1.0778
irintensity: 1.2095 0.1109 2.7583 0.9619 1.7222 1.7375 0.8615 9.1959 1.1165 0.2485 1.7363 3.3463 0.4760 0.0248 0.4918 0.1473 1.6178 0.6841 2.9013 0.1083 4.7108 5.0664 1.0970 0.1244 2.1454 0.2486 9.2483 3.1086 2.5738 22.8388 44.8692 3.6022 29.1746 23.2883 5.8610 0.1018 1.0332 1.9289 9.0263 58.6194 5.1014 4.2921 70.2362 45.3306 44.7400 3.5098 13.0679 14.8318 0.4825 2.8614 0.4681 1.0889 2.6791 0.1654 4.9178 6.6892 4.7091 1.7177 0.1981 0.2849 0.7892 0.3731 9.3884 0.1435 11.7002 1.3220 5.3436 9.6347 10.6975 9.4190 5.1072 8.0249 2.9925 11.7775 1.7011 16.6512 3.2624 11.5193 40.9494 36.8440 22.9300 49.3812 1.7355 0.0271 16.1951 3.2927 40.1183 33.7270 2.2169 13.3561 40.0274 5.6172 8.9212 12.5994 9.5802 79.1336 59.0834 9.7416 5.2603 21.1138 62.2235 11.3400 7.9694 54.9054 19.1613 2.0965 1.0327 15.3434 14.1424 96.6314 23.6614 36.7122 9.5570 27.7790 25.7794 3.0868 28.7473 36.8164 36.0415 35.4626 25.0650 10.7489 4.6722 0.7916 5.4844 29.1371 34.3379 8.4543 14.8986 6.5029 11.1648 18.4966
temp: 298.150 k
press: 1.00000 atm
elementType: 8 8 7 7 6 6 6 6 6 6 6 6 6 6 6 6 6 6 6 6 6 6 6 6 1 1 1 1 1 1 1 1 1 1 1 1 1 1 1 1 1 1 1 1 1 1
symmnumber: 1
zpe: 983072.3 jmol-1
zpe.correction: 0.374432 hartree
zpe.thermalcorrener: 0.396822 hartree
zpe.thermalcorrenthalpy: 0.397767 hartree
zpe.thermalcorrgfe: 0.321211 hartree
zpe.sumelectzpe: -1033.527618 hartree
zpe.sumelectthermal: -1033.505228 hartree
zpe.sumelectthermalent: -1033.504284 hartree
zpe.sumelectthermalfe: -1033.580840 hartree
dipole: 1.7211 -0.6605 -0.1011
dipole: 1.8462
quadrupole: -138.4149 -127.4536 -146.7886
quadrupole: 9.4588 9.0897 4.5146
quadrupole: -0.8625 10.0987 -9.2362 9.4588 9.0897 4.5146
hfenergy: -1033.9020509 hartree
pointgroup: C01 [X(C20H22N2O2)]
dipole: -0.671799 0.2733457 -0.039596 debye
polarizability: 217.1251985|26.2085053|256.5386454|25.7691129|-18.2552507|193.3147252 unknown
InChI: InChI=1S/C20H22N2O2/c1-4-15(18-16-12-8-9-13-17(16)24-22-18)19(23)21-20(2,3)14-10-6-5-7-11-14/h5-13,15,21H,4H2,1-3H3
charge 0 multiplicity 1
46 atoms
O  3.141639 -0.104867 2.00899
O  -0.788297 -1.307803 -1.578715
N  -1.306173 -1.554668 0.683679
N  2.33247 -1.327132 1.737077
C  -2.680643 -0.962869 0.64668
C  0.933612 -2.254737 -0.067391
C  -0.470794 -1.671003 -0.406336
C  -2.61273 0.514486 0.184105
C  1.586004 -2.909599 -1.314832
C  1.796886 -1.154159 0.510414
C  -3.206986 -0.999632 2.109106
C  -3.584323 -1.84609 -0.250752
C  2.175464 0.117437 -0.08027
C  0.860188 -4.199512 -1.749369
C  -1.593535 1.359349 0.695498
C  -3.582973 1.079633 -0.678426
C  3.016662 0.728885 0.887655
C  1.879691 0.796461 -1.29034
C  -1.542305 2.72697 0.354391
C  -3.53774 2.450857 -1.020067
C  3.61025 1.991451 0.711972
C  -2.519191 3.282229 -0.504582
C  2.463552 2.06281 -1.486737
C  3.31814 2.646859 -0.503602
H  0.822161 -3.027482 0.719907
H  -0.955985 -1.872883 1.590937
H  1.572283 -2.18101 -2.145128
H  2.644237 -3.129373 -1.078344
H  -3.269108 -2.040794 2.47917
H  -2.555709 -0.41404 2.783389
H  -4.216041 -0.557556 2.152795
H  -3.539808 -2.891391 0.102697
H  -3.243939 -1.811837 -1.297976
H  -4.636738 -1.51681 -0.1978
H  1.361028 -4.651598 -2.624293
H  -0.184754 -3.985014 -2.034619
H  0.856093 -4.952394 -0.938234
H  -0.820413 0.941508 1.351713
H  -4.372019 0.454378 -1.107192
H  1.199531 0.35788 -2.02671
H  -0.737957 3.356053 0.752414
H  -4.295547 2.866203 -1.694362
H  4.257021 2.435245 1.473059
H  -2.48219 4.344188 -0.772266
H  2.254538 2.617096 -2.407406
H  3.755548 3.633179 -0.693898
