program: Gaussian 09
title: 000176671
version: EM64L-G09RevD.01
frameworkgroup: C1[X(C18H17ClN2O2)]
method: RPBEPBE
basis: SDD
operation: Freq
keyword: #p
keyword: freq=noraman
keyword: PBEPBE/SDD
title: #p freq=noraman PBEPBE/SDD
converged: YES YES NO NO
title: Mulliken charges:
elementType: Cl O O N N C C C C C C C C C C C C C C C C C C H H H H H H H H H H H H H H H H H
charge: -0.078798 -0.220039 -0.230498 -0.440596 -0.055378 0.162611 0.536318 -0.748107 -0.738358 0.262110 -0.657996 -0.348648 -0.412242 0.218529 0.079667 -0.112578 -0.217470 0.198214 -0.249611 -0.319003 -0.367168 -0.260226 -0.193874 0.306950 0.219015 0.233054 0.246491 0.219506 0.279003 0.207926 0.233439 0.272904 0.264733 0.245351 0.231607 0.257957 0.249074 0.255871 0.238033 0.232224
chargesum: 0.00000
title: Mulliken charges with hydrogens summed into heavy atoms:
elementType: Cl O O N N C C C C C C C C C C C C C C C C C C
charge: -0.078798 -0.220039 -0.230498 -0.133646 -0.055378 0.162611 0.536318 -0.049546 -0.031923 0.262110 -0.151652 -0.083915 -0.166891 0.218529 0.079667 -0.112578 0.014137 0.198214 0.008346 -0.069929 -0.111297 -0.022192 0.038350
polarizability: 2.24150443e+02 -1.38822033e+01 2.54725571e+02 4.44674032e+00 8.31708101e+00 1.58207073e+02
1716.lowfreq: -3.5835 -0.0001 0.0006 0.0014 5.0271 7.7749 20.9495 24.0992 33.2341
frequency: 20.8621 24.0197 33.1822 38.3442 57.6270 82.3256 128.0620 139.1429 158.5669 182.4880 187.1353 213.0373 221.6655 239.9903 248.7569 274.4221 293.3766 307.4585 331.4176 339.9017 344.4808 393.5174 406.5077 423.0288 442.2788 448.1395 487.9088 496.7602 518.1503 545.6224 546.3394 574.5917 589.9363 609.0837 617.7381 656.3913 693.5246 703.3068 740.0271 747.9958 758.3061 761.8235 785.5815 789.0294 808.2161 854.5402 860.3655 888.3576 897.2279 905.0921 911.1504 932.6882 941.1106 947.5353 976.2699 979.3912 985.5233 986.8726 1008.4573 1012.6686 1071.4444 1074.0246 1084.3172 1119.1721 1127.7015 1157.9967 1160.2926 1181.0703 1184.5398 1191.3669 1200.1156 1227.3171 1245.2440 1271.3332 1289.3669 1317.9328 1373.8842 1376.3156 1377.5638 1395.0375 1405.7625 1414.2085 1417.0095 1433.6557 1454.9993 1464.5738 1466.5338 1474.3944 1474.6051 1479.6630 1486.7370 1494.9002 1574.7786 1600.2155 1609.1586 1618.1185 1628.9509 2979.4147 2979.7032 2995.4395 3046.2562 3073.8061 3086.9602 3100.1562 3113.9604 3139.4350 3142.1034 3147.7630 3156.1098 3169.4400 3173.9367 3179.3188 3182.8769 3529.5340
redmass: 5.4185 6.1480 6.4276 7.8753 5.7843 7.7964 3.8123 4.2395 6.0644 3.5883 4.4495 4.9364 5.5027 1.7876 1.7787 2.3342 1.5705 1.8796 3.2003 5.6605 5.8388 6.7501 3.1078 3.0144 4.0997 3.4115 2.6500 2.5119 2.2022 3.8952 4.5351 4.7220 4.4574 3.8829 4.7603 6.7323 3.0511 3.1612 5.3179 4.8970 1.4546 5.1199 3.9344 1.5287 7.2801 3.6565 1.7855 2.1794 1.7213 1.7741 2.2823 1.4633 2.2991 1.4294 2.0213 1.6790 3.6227 1.4287 2.1256 1.3472 3.4352 3.1383 1.6104 1.9147 1.6258 1.6922 1.4785 1.5827 1.2633 2.1347 1.9187 2.3649 2.7318 1.5076 1.3768 1.6884 8.1022 1.7171 1.8041 1.2200 3.5468 4.4994 2.7208 1.1126 1.5681 1.6192 1.2103 1.6271 1.8576 4.9321 1.1358 1.0696 6.5853 7.5012 6.9315 7.7675 6.8344 1.0409 1.0577 1.0359 1.0968 1.1001 1.0994 1.0986 1.1009 1.0866 1.0876 1.0912 1.0907 1.0922 1.0962 1.0983 1.0984 1.0778
irintensity: 1.1783 0.9613 1.1273 0.2222 2.0087 10.6088 0.9586 0.9045 1.1817 5.1118 0.5366 0.7093 0.8670 0.8162 1.6587 1.0899 0.2198 2.9341 2.3458 3.6152 0.6793 6.1779 2.0616 4.0400 4.3413 7.9567 12.5720 36.9402 35.9502 7.0006 4.5723 4.0466 4.3230 1.6579 1.6063 8.7787 44.5100 11.5193 2.3308 11.1841 86.1020 5.2706 31.0939 35.4734 15.0350 6.0649 1.9558 5.1217 19.6913 0.6705 2.0716 6.1814 5.0859 1.0589 4.8563 3.9995 3.9327 1.2405 6.6567 0.1529 14.3944 14.1759 4.7812 2.0301 2.2872 34.0736 5.2909 12.8021 5.5501 32.0892 8.8926 48.4274 73.0990 0.2537 6.4979 36.2330 5.5224 30.1307 34.8032 45.7042 5.1403 10.1120 27.2138 22.9073 188.1527 34.4698 32.1893 10.9677 11.6306 9.4412 12.8073 19.7125 36.3550 3.4578 22.6045 15.7957 114.2038 7.2184 35.8220 26.2076 3.2622 28.3457 29.4099 24.4907 9.5508 4.0272 7.9648 3.9327 11.2197 6.2203 8.8344 8.4964 7.5399 16.2583
temp: 298.150 k
press: 1.00000 atm
elementType: 17 8 8 7 7 6 6 6 6 6 6 6 6 6 6 6 6 6 6 6 6 6 6 1 1 1 1 1 1 1 1 1 1 1 1 1 1 1 1 1
symmnumber: 1
zpe: 811174.8 jmol-1
zpe.correction: 0.308960 hartree
zpe.thermalcorrener: 0.329760 hartree
zpe.thermalcorrenthalpy: 0.330704 hartree
zpe.thermalcorrgfe: 0.257652 hartree
zpe.sumelectzpe: -1414.466142 hartree
zpe.sumelectthermal: -1414.445343 hartree
zpe.sumelectthermalent: -1414.444398 hartree
zpe.sumelectthermalfe: -1414.517450 hartree
dipole: 5.1112 0.0241 -2.4840
dipole: 5.6829
quadrupole: -141.9476 -135.7148 -138.3843
quadrupole: -21.3477 4.3110 13.8168
quadrupole: -3.2654 2.9675 0.2979 -21.3477 4.3110 13.8168
hfenergy: -1414.7751021 hartree
pointgroup: C01[X(C18H17Cl1N2O2)]
dipole: -1.8546817 0.1047775 1.2442073 debye
polarizability: 228.267843|16.9415355|251.529261|-2.9719513|2.9654123|157.2859831 unknown
InChI: InChI=1S/C18H17ClN2O2/c1-18(2,12-6-5-7-13(19)10-12)20-17(22)11-15-14-8-3-4-9-16(14)23-21-15/h3-10,20H,11H2,1-2H3
charge 0 multiplicity 1
40 atoms
Cl -0.915536 3.382772 2.136175
O  4.276307 -1.630292 -0.864755
O  -0.41365 -1.301102 -1.022211
N  -1.371952 -1.885838 1.020425
N  3.182379 -2.543042 -0.452352
C  -2.756918 -1.414101 0.707972
C  -2.728922 0.107886 0.417644
C  -3.604255 -1.662417 1.987473
C  -3.333949 -2.246311 -0.465031
C  -0.311514 -1.80901 0.130463
C  1.002639 -2.419217 0.664764
C  -1.962101 0.947592 1.266618
C  -3.481381 0.702722 -0.622548
C  2.231051 -1.761709 0.096951
C  2.598825 -0.35869 0.086846
C  -1.953203 2.33333 1.048097
C  -3.463799 2.10249 -0.81678
C  3.881737 -0.327675 -0.520105
C  -2.69393 2.942257 0.018476
C  1.993563 0.851485 0.508817
C  4.614392 0.853934 -0.728667
C  2.708481 2.048988 0.314764
C  3.999627 2.047603 -0.293704
H  -1.22627 -2.347693 1.920847
H  -3.645595 -2.742382 2.224782
H  -3.192047 -1.117043 2.856025
H  -4.635902 -1.30745 1.828627
H  -3.280611 -3.319487 -0.210575
H  -2.756236 -2.073686 -1.387058
H  -4.39423 -1.995956 -0.644877
H  1.031466 -2.36298 1.771485
H  1.029136 -3.49142 0.392924
H  -1.365375 0.516124 2.076735
H  -4.065999 0.080423 -1.305018
H  -4.043447 2.547135 -1.632781
H  -2.664833 4.024875 -0.132043
H  0.992934 0.867721 0.949605
H  5.599288 0.844713 -1.202312
H  2.262134 2.998615 0.62725
H  4.525796 2.998337 -0.43275
