program: Gaussian 09
title: 000176667
version: EM64L-G09RevD.01
frameworkgroup: C1[X(C19H20N2O2)]
method: RPBEPBE
basis: SDD
operation: Freq
keyword: #p
keyword: freq=noraman
keyword: PBEPBE/SDD
title: #p freq=noraman PBEPBE/SDD
converged: YES YES NO NO
title: Mulliken charges:
elementType: O O N N C C C C C C C C C C C C C C C C C C C H H H H H H H H H H H H H H H H H H H H
charge: -0.202336 -0.268332 -0.461030 -0.151563 0.173949 0.507525 -0.752523 -0.748403 0.207739 -0.613340 0.187805 -0.402312 -0.383759 0.097484 0.071328 0.325198 -0.241602 -0.249429 -0.365379 -0.245189 -0.384184 -0.224936 -0.778306 0.397583 0.218471 0.276057 0.204155 0.219566 0.233013 0.236108 0.274028 0.263008 0.237584 0.237952 0.220169 0.220576 0.253426 0.224811 0.239277 0.232042 0.244860 0.223991 0.244918
chargesum: 0.00000
title: Mulliken charges with hydrogens summed into heavy atoms:
elementType: O O N N C C C C C C C C C C C C C C C C C C C
charge: -0.202336 -0.268332 -0.063447 -0.151563 0.173949 0.507525 -0.053840 -0.059716 0.207739 -0.076304 0.187805 -0.164728 -0.145807 0.097484 0.071328 0.325198 -0.021433 -0.028853 -0.111953 -0.020377 -0.144907 0.007106 -0.064537
polarizability: 3.05522849e+02 1.14187109e+01 1.96410518e+02 6.78816919e+00 1.80239409e+00 1.65484383e+02
1716.lowfreq: -4.3811 -0.0001 0.0004 0.0006 2.4756 5.1704 6.5118 20.6680 30.6419
frequency: 4.9246 20.5605 30.4754 53.5396 66.1887 78.2496 93.7439 116.1202 140.3521 143.4166 175.4845 195.3040 217.3210 240.7780 250.9019 254.8359 282.2508 292.8127 315.8379 325.1795 338.9562 343.4525 396.4996 402.4589 457.1966 485.8232 494.3742 497.9328 524.8709 543.7771 550.8209 584.9830 604.3064 617.2020 632.0036 635.2887 673.6276 701.9601 723.0055 738.0780 749.3673 758.1656 770.8938 792.5571 824.0670 848.0922 852.0627 895.9318 898.6154 906.2738 917.3132 932.7912 936.0437 940.1787 973.3582 978.1188 979.4613 990.0000 992.0971 1008.8906 1014.1686 1026.5558 1048.3890 1073.9818 1084.0519 1107.3550 1134.7894 1171.7351 1177.0772 1181.4538 1184.9388 1193.2998 1197.5617 1207.2127 1250.0744 1265.5017 1268.9346 1285.4465 1318.6623 1374.0105 1379.8080 1380.2302 1380.9087 1393.4015 1404.2314 1416.0275 1423.5704 1435.1270 1462.7149 1463.1384 1463.7769 1466.7497 1478.7537 1484.0285 1485.3438 1495.0991 1496.1759 1540.5436 1592.9885 1605.3997 1612.7962 1617.1875 1622.4497 2981.0179 2986.2714 2989.2774 2992.5266 3045.8083 3064.3402 3076.8770 3083.7348 3098.2007 3099.0066 3113.2341 3115.4903 3124.8541 3133.2239 3137.5319 3149.3415 3152.9135 3165.5500 3169.5787 3319.3652
redmass: 4.7513 5.2366 3.8236 4.6034 5.2711 6.6008 1.0303 2.9298 4.6250 3.5688 3.9232 3.8800 2.1480 3.9574 2.4491 1.5977 1.9835 1.4052 3.9172 2.7531 4.0030 7.3683 3.2888 2.8120 3.8551 5.6098 4.1790 4.0965 3.5928 3.2893 4.0322 3.8060 5.5548 6.3970 5.0748 5.2768 5.7119 1.6501 4.5580 6.0039 2.6657 1.1233 1.8998 1.6341 5.9889 1.2766 5.7846 2.6966 3.9869 1.3796 1.5930 1.4578 2.7199 2.4835 1.4282 1.3416 2.4172 2.2461 2.0592 1.8478 1.6386 2.3999 1.5114 1.7860 1.6318 2.0773 2.5919 1.0657 3.0304 3.1942 1.4700 1.1694 2.5497 1.1129 3.2239 2.5949 1.6261 2.5465 1.3475 1.2347 2.8583 4.4566 3.3883 1.2070 1.3533 4.6620 1.3907 2.2181 1.0569 1.1197 1.7069 1.0662 1.0813 1.8867 1.5011 1.0875 3.5256 1.6172 6.0944 6.8514 6.1444 6.1122 7.6629 1.0357 1.0372 1.0638 1.0358 1.0942 1.0973 1.1002 1.0993 1.0992 1.0996 1.1005 1.0849 1.0871 1.0878 1.0934 1.0910 1.0956 1.0990 1.0992 1.0830
irintensity: 0.1124 0.6635 0.2298 0.6053 3.1704 7.4849 0.2931 10.3622 0.4214 0.9426 4.6668 0.2319 0.1473 1.0796 3.8754 2.3654 0.5367 0.5583 1.4650 3.7161 0.8070 1.2530 5.8297 0.2838 4.3813 2.0990 2.2219 2.1682 6.1368 17.6446 0.3308 8.8657 1.9829 0.0190 10.9645 4.6377 11.6365 53.4978 2.6317 20.5697 17.6141 79.9208 35.8934 46.8789 5.1928 0.4587 28.9202 0.2030 0.9606 0.3496 0.5231 4.9583 3.9940 5.5422 0.4840 0.0877 4.3417 0.1380 0.7149 0.2244 0.2701 14.5574 7.5842 23.1509 10.5202 8.9075 0.4769 0.2517 14.5752 16.4090 4.3254 9.0409 21.2655 1.3927 39.9752 22.0383 1.3978 78.0491 2.7928 33.8025 51.6686 1.4221 13.2525 30.6295 14.6934 5.5750 27.2792 14.1396 15.7402 12.0605 17.7092 15.9507 14.5524 10.8204 4.3635 20.6565 5.2590 344.7139 3.4343 41.0961 27.1891 150.6469 29.4526 19.7615 21.2335 1.8115 28.6924 2.4354 12.6384 22.5829 47.5383 39.5175 15.6798 8.4289 6.6833 1.2499 7.2110 34.5824 10.5537 39.6182 17.6427 16.2115 412.7565
temp: 298.150 k
press: 1.00000 atm
elementType: 8 8 7 7 6 6 6 6 6 6 6 6 6 6 6 6 6 6 6 6 6 6 6 1 1 1 1 1 1 1 1 1 1 1 1 1 1 1 1 1 1 1 1
symmnumber: 1
zpe: 908282.5 jmol-1
zpe.correction: 0.345947 hartree
zpe.thermalcorrener: 0.367246 hartree
zpe.thermalcorrenthalpy: 0.368190 hartree
zpe.thermalcorrgfe: 0.292708 hartree
zpe.sumelectzpe: -994.311317 hartree
zpe.sumelectthermal: -994.290018 hartree
zpe.sumelectthermalent: -994.289074 hartree
zpe.sumelectthermalfe: -994.364556 hartree
dipole: 4.8217 0.8557 0.7837
dipole: 4.9594
quadrupole: -109.3802 -136.5462 -133.9993
quadrupole: -8.4170 0.8113 -4.4393
quadrupole: 17.2617 -9.9043 -7.3574 -8.4170 0.8113 -4.4393
hfenergy: -994.6572639 hartree
pointgroup: C01 [X(C19H20N2O2)]
dipole: -1.936201 -0.1216576 -0.2083615 debye
polarizability: 303.0750551|-9.0167765|187.2580116|21.503073|12.2353532|177.0846832 unknown
InChI: InChI=1S/C19H20N2O2/c1-13-8-7-11-15-16(21-23-18(13)15)12-17(22)20-19(2,3)14-9-5-4-6-10-14/h4-11,20H,12H2,1-3H3
charge 0 multiplicity 1
43 atoms
O  -2.7215 -0.822218 -1.190556
O  2.123007 2.014019 0.103961
N  1.35863 -0.017937 -0.766651
N  -1.355971 -0.370812 -0.858429
C  2.696105 -0.577212 -1.131801
C  3.551679 -0.781013 0.143963
C  3.3717 0.341012 -2.181855
C  2.419516 -1.968618 -1.769906
C  1.180522 1.213369 -0.187196
C  -0.267588 1.639699 0.165348
C  -1.463775 0.858253 -0.317752
C  4.933124 -0.475555 0.189435
C  2.954289 -1.363358 1.29248
C  -2.851609 1.284772 -0.254425
C  -3.594806 0.211846 -0.80558
C  -5.000157 0.19595 -0.944886
C  5.697021 -0.741964 1.349213
C  3.711594 -1.629829 2.452148
C  -3.523391 2.446329 0.203386
C  5.091944 -1.321917 2.485673
C  -5.640476 1.368014 -0.478652
C  -4.925309 2.468829 0.082191
C  -5.73735 -0.980958 -1.543939
H  0.515235 -0.573208 -0.98751
H  2.685912 0.481402 -3.036062
H  3.600973 1.326734 -1.746728
H  4.300443 -0.116428 -2.566455
H  1.80233 -1.862457 -2.681565
H  1.89724 -2.636817 -1.061765
H  3.373152 -2.448269 -2.047125
H  -0.302808 1.693114 1.272427
H  -0.362806 2.686765 -0.177729
H  5.421935 -0.008465 -0.670748
H  1.881902 -1.593408 1.282178
H  6.76342 -0.488643 1.365567
H  3.227529 -2.074435 3.329513
H  -2.977064 3.291085 0.634053
H  5.683312 -1.525129 3.385663
H  -6.732491 1.428446 -0.554093
H  -5.486461 3.345273 0.422555
H  -5.547601 -1.905784 -0.968645
H  -6.824788 -0.800538 -1.56076
H  -5.402167 -1.176941 -2.579142
