program: Gaussian 09
title: 000176660
version: EM64L-G09RevD.01
frameworkgroup: C1[X(C14H8Cl2O4)]
method: RPBEPBE
basis: SDD
operation: Freq
keyword: #p
keyword: freq=noraman
keyword: PBEPBE/SDD
title: #p freq=noraman PBEPBE/SDD
converged: YES YES NO NO
title: Mulliken charges:
elementType: Cl Cl O O O O C C C C C C C C C C C C C C H H H H H H H H
charge: 0.005214 0.005083 -0.273602 -0.265808 -0.289809 -0.248776 0.271029 0.232891 0.269262 0.266784 -0.484113 0.272999 -0.358972 -0.357716 -0.350471 -0.349607 -0.083013 -0.084781 0.167227 -0.497318 0.302374 0.267552 0.279674 0.290667 0.290328 0.234181 0.244390 0.244329
chargesum: 0.00000
title: Mulliken charges with hydrogens summed into heavy atoms:
elementType: Cl Cl O O O O C C C C C C C C C C C C C C
charge: 0.005214 0.005083 -0.273602 -0.265808 -0.289809 -0.248776 0.271029 0.232891 0.269262 0.266784 -0.181739 0.272999 -0.091420 -0.078042 -0.059804 -0.059278 -0.083013 -0.084781 0.167227 0.225583
polarizability: 3.54754921e+02 3.14475538e+00 1.84868019e+02 3.73123321e-02 -2.10442831e-02 7.19695848e+01
1716.lowfreq: -5.9807 -0.0030 -0.0025 -0.0020 1.8123 3.3509 25.4191 41.7681 72.5853
frequency: 25.4070 41.7641 72.5843 81.0957 89.3634 100.8257 147.4449 155.3622 156.8407 178.8186 201.0085 239.9622 260.4268 260.6422 305.9792 329.3749 360.2993 368.2940 390.7923 444.2133 450.0572 456.7835 496.0191 522.5290 539.8868 562.6369 589.7094 608.5092 654.7695 657.6947 682.5822 710.9258 722.6322 735.6089 761.7475 829.0055 839.5512 843.0473 865.1109 865.9389 914.6581 914.9443 951.0796 976.5800 1061.4645 1085.0494 1098.5703 1108.6911 1113.6638 1147.5657 1157.3815 1197.2295 1219.8428 1243.1533 1264.5589 1281.9293 1353.8665 1368.0672 1392.5174 1420.0878 1427.0325 1451.6375 1463.1275 1464.9642 1488.1914 1572.2318 1584.1840 1601.4797 1626.9127 1636.6135 3005.8809 3108.4889 3150.5971 3163.6910 3181.2253 3182.5104 3184.6907 3190.6395
redmass: 10.8830 6.2400 4.3051 6.2356 2.1083 1.9827 7.7437 7.6549 5.6767 25.9694 5.5010 9.8520 7.8766 7.2348 6.0407 7.2209 8.5094 11.8958 11.3496 3.0773 3.1984 6.9892 6.0024 8.5534 6.1775 9.7589 11.5148 9.1929 7.5580 3.9731 5.3072 7.0556 7.0872 4.1903 6.4081 6.1161 1.4279 1.4068 7.7422 1.3892 9.2617 1.4712 5.2007 1.3424 2.8913 3.9220 1.6790 8.3259 1.2634 1.4574 1.5166 2.5491 1.2744 2.6389 1.9882 5.6685 7.2913 9.1849 7.4431 1.7811 2.1097 1.0498 1.1184 3.2280 3.3938 9.5612 8.1978 8.7628 10.2272 8.1610 1.0294 1.1046 1.1049 1.0887 1.0969 1.0923 1.0932 1.0928
irintensity: 0.0150 1.0622 0.7982 0.2752 1.0302 0.0395 0.2083 0.7050 4.9002 0.0866 4.4505 0.8603 3.1599 0.0515 18.1745 0.7587 1.5921 3.0926 9.6378 6.4016 5.5062 4.9060 4.8964 0.7624 0.0447 5.1174 0.0029 1.1157 14.2926 0.2047 4.9480 1.8249 4.9418 31.8376 19.1692 124.4000 3.0138 24.6575 38.4001 55.8160 18.0325 30.0295 41.1589 0.2076 117.0736 158.5406 86.7760 61.2624 0.0386 46.3657 21.8451 38.3503 2.9116 89.5960 83.2560 772.5880 9.8911 78.7825 2.7428 11.7013 139.5333 14.5998 52.4027 528.8492 142.1072 80.1026 13.5505 86.3225 148.4234 37.0190 42.9598 25.4331 13.8813 0.1623 1.3457 2.9531 1.5737 5.1744
temp: 298.150 k
press: 1.00000 atm
elementType: 17 17 8 8 8 8 6 6 6 6 6 6 6 6 6 6 6 6 6 6 1 1 1 1 1 1 1 1
symmnumber: 1
zpe: 486642.3 jmol-1
zpe.correction: 0.185352 hartree
zpe.thermalcorrener: 0.202833 hartree
zpe.thermalcorrenthalpy: 0.203777 hartree
zpe.thermalcorrgfe: 0.138371 hartree
zpe.sumelectzpe: -1757.890946 hartree
zpe.sumelectthermal: -1757.873465 hartree
zpe.sumelectthermalent: -1757.872520 hartree
zpe.sumelectthermalfe: -1757.937927 hartree
dipole: -1.7300 0.7943 0.0065
dipole: 1.9037
quadrupole: -137.7588 -118.2440 -129.8224
quadrupole: -14.3380 -0.0524 -0.0053
quadrupole: -9.1504 10.3644 -1.2140 -14.3380 -0.0524 -0.0053
hfenergy: -1758.0762978 hartree
pointgroup: C01 [X(C14H8Cl2O4)]
dipole: 0.6835674 -0.3055778 0.0173822 debye
polarizability: 354.6212439|4.8730442|184.9170742|3.8899828|-1.8063091|72.0542069 unknown
InChI: InChI=1S/C14H8Cl2O4/c1-18-14(17)7-2-3-10-11(4-7)20-13-6-9(16)8(15)5-12(13)19-10/h2-6H,1H3
charge 0 multiplicity 1
28 atoms
Cl -5.430584 -2.286191 -0.005287
Cl -6.056484 0.948299 -0.065043
O  -0.38917 -1.122655 0.045517
O  -0.943585 1.748843 -0.008035
O  4.581962 -1.510159 0.127638
O  5.456468 0.650856 0.097742
C  0.65196 -0.151075 0.044927
C  0.379082 1.240313 0.018494
C  -1.707834 -0.610886 0.019313
C  -1.97914 0.779452 -0.006669
C  1.971237 -0.615132 0.071293
C  3.038682 0.319535 0.071258
C  1.433102 2.170152 0.017972
C  2.76399 1.710936 0.044183
C  -2.763771 -1.533887 0.019568
C  -3.301327 1.244114 -0.032197
C  -4.095798 -1.068796 -0.006193
C  -4.36444 0.316085 -0.031927
C  4.462486 -0.116807 0.099074
C  5.970347 -2.028334 0.157607
H  2.170698 -1.688723 0.091605
H  1.193021 3.236723 -0.002974
H  3.602691 2.412999 0.044464
H  -2.541832 -2.603519 0.039767
H  -3.493438 2.319495 -0.052072
H  5.86153 -3.121528 0.180504
H  6.494869 -1.660478 1.055246
H  6.518678 -1.700632 -0.741371
