program: Gaussian 09
title: 000176537
version: EM64L-G09RevD.01
frameworkgroup: C1[X(C18H16O2)]
method: RPBEPBE
basis: SDD
operation: Freq
keyword: #pfreq=noraman
keyword: PBEPBE/SDD
title: #p freq=noraman PBEPBE/SDD
converged: YES YES NO NO
title: Mulliken charges:
elementType: O O C C C C C C C C C C C C C C C C C C H H H H H H H H H H H H H H H H
charge: -0.451119 -0.483399 -0.260780 -0.142253 0.158260 -0.463772 -0.552250 0.292602 0.193750 0.486006 -0.412576 -0.498768 -0.606586 -0.706666 0.412395 0.400487 -0.435186 -0.424914 -0.246743 -0.243705 0.224157 0.210733 0.245206 0.195754 0.231771 0.226080 0.230516 0.240857 0.284851 0.244494 0.363575 0.349580 0.244862 0.239552 0.226784 0.226447
chargesum: 0.00000
title: Mulliken charges with hydrogens summed into heavy atoms:
elementType: O O C C C C C C C C C C C C C C C C C C
charge: -0.087545 -0.133819 -0.036624 0.068480 0.158260 -0.022813 -0.094399 0.292602 0.193750 0.486006 -0.182060 -0.257911 -0.321734 -0.462172 0.412395 0.400487 -0.190324 -0.185362 -0.019958 -0.017257
polarizability: 3.43003471e+02 -3.43468041e+01 2.21070303e+02 3.18854057e-01 6.23169207e-01 9.49198683e+01
1716.lowfreq: -6.2267 -0.2275 -0.0006 -0.0005 -0.0005 7.2545 55.0359 61.5354 93.1784
frequency: 55.0319 61.5333 93.1698 120.8569 125.3819 182.9932 217.1020 242.0866 250.4767 266.5008 278.5410 300.7631 310.5332 361.5517 383.2192 387.4658 413.2340 439.6655 470.4871 485.5984 505.9980 523.4739 539.3168 574.4771 588.3189 618.9893 622.2133 640.3979 672.9752 729.8212 749.8302 759.4579 767.0013 784.4296 811.1552 816.4252 833.8523 855.6502 867.9864 895.1915 903.7075 919.6448 930.8631 965.0189 966.3528 975.0965 988.7808 993.9199 1007.5233 1014.5615 1059.9300 1075.5938 1091.4612 1130.5848 1150.8532 1169.5849 1172.2021 1183.0296 1192.2463 1204.1860 1218.0523 1234.0397 1249.3620 1278.1121 1289.5683 1296.0934 1306.1606 1316.5896 1332.2435 1345.9500 1365.7237 1384.8006 1397.5762 1403.9260 1421.3075 1437.5787 1440.1748 1454.5591 1464.8999 1466.0846 1484.7828 1554.2753 1567.0403 1589.5291 1630.8429 1637.3148 2941.0843 2954.4863 2969.5828 2984.4291 3025.7246 3056.2915 3112.2903 3115.9246 3118.3821 3124.3470 3138.8943 3141.7778 3149.9395 3160.9747 3463.3224 3590.3023
redmass: 4.7954 4.1860 5.0127 5.4811 4.2748 4.6631 2.5755 1.8293 3.0552 2.1831 4.4509 5.0163 3.2502 3.6775 4.3207 5.4274 3.4986 4.2548 2.4666 2.6000 1.3909 3.6151 4.0392 3.7185 4.0756 4.5900 4.9044 4.3167 4.7452 5.0853 1.3718 3.3854 3.5912 2.1146 1.7493 2.7820 2.7293 1.5667 2.3345 2.2401 2.2863 2.9269 2.2022 1.5346 2.3544 1.4105 1.3478 4.3409 2.9277 2.2866 2.2261 2.2015 2.2151 1.7398 1.1771 1.1511 1.5225 1.4219 1.2997 1.7045 1.3291 1.3643 1.2058 2.4011 1.5354 2.5256 1.2837 1.2824 1.8536 1.5695 1.5557 1.6353 2.2579 3.4992 2.2553 5.4770 6.1626 1.3079 1.1775 1.8968 2.9977 5.5853 8.2383 5.5399 6.8508 6.6864 1.0825 1.0662 1.0852 1.0627 1.0934 1.1009 1.0861 1.0906 1.0860 1.0883 1.0978 1.0952 1.0911 1.1003 1.0642 1.0664
irintensity: 4.0904 0.3948 2.0787 2.6671 0.7024 4.7865 2.6053 60.2632 14.3290 52.2891 6.2902 6.1141 4.9917 8.4751 4.6242 2.5483 4.7423 2.0642 21.0951 17.2795 108.4985 1.5748 1.7223 10.8268 1.2518 5.8245 1.9596 34.3567 2.0807 5.8377 61.7998 6.9563 9.8199 0.5905 2.8501 12.8146 10.0691 0.2175 4.8199 27.2052 50.3827 26.1469 0.8012 6.0177 1.5894 6.9181 0.0731 135.7620 4.2397 5.6706 11.2517 10.5494 0.9515 5.5339 12.8434 2.7824 15.5877 6.9381 8.0177 41.7632 12.0353 25.5790 10.9415 2.8171 5.1132 3.1759 0.3360 2.5600 1.5357 13.9154 1.7263 16.2514 19.1416 4.6466 3.8246 2.8428 0.7554 9.3863 15.1004 2.0841 2.2061 12.0511 0.1019 1.7185 17.6433 1.6022 26.0134 29.1630 63.9242 67.2161 26.4652 33.2503 5.0464 6.4977 6.9357 0.1919 33.9544 36.4299 2.2997 47.7048 31.8548 6.2585
temp: 298.150 k
press: 1.00000 atm
elementType: 8 8 6 6 6 6 6 6 6 6 6 6 6 6 6 6 6 6 6 6 1 1 1 1 1 1 1 1 1 1 1 1 1 1 1 1
symmnumber: 1
zpe: 761498.7 jmol-1
zpe.correction: 0.290040 hartree
zpe.thermalcorrener: 0.305757 hartree
zpe.thermalcorrenthalpy: 0.306701 hartree
zpe.thermalcorrgfe: 0.247811 hartree
zpe.sumelectzpe: -844.579863 hartree
zpe.sumelectthermal: -844.564145 hartree
zpe.sumelectthermalent: -844.563201 hartree
zpe.sumelectthermalfe: -844.622091 hartree
dipole: -2.9060 1.1744 -1.4091
dipole: 3.4365
quadrupole: -85.8693 -106.5949 -124.3825
quadrupole: 0.3106 2.6671 1.4873
quadrupole: 19.7463 -0.9793 -18.7670 0.3106 2.6671 1.4873
hfenergy: -844.8699021 hartree
pointgroup: C01 [X(C18H16O2)]
dipole: 1.1495126 -0.4352373 -0.5631274 debye
polarizability: 344.4466767|-31.6174392|219.6133539|-2.0435531|-0.1029951|94.9336116 unknown
InChI: InChI=1S/C18H16O2/c19-16-8-7-11-5-6-14-9-12-3-1-2-4-13(12)10-15(14)17(11)18(16)20/h1-6,9-10,16,18-20H,7-8H2
charge 0 multiplicity 1
36 atoms
O  1.926991 1.949784 1.06613
O  4.053543 2.569045 -0.406013
C  2.082189 1.233913 -0.21876
C  3.577287 1.181371 -0.59767
C  1.463363 -0.150368 -0.091309
C  4.325824 0.168856 0.277222
C  3.785486 -1.240963 -0.039996
C  2.261314 -1.299861 -0.031147
C  0.014159 -0.264427 -0.055071
C  -0.596513 -1.589707 -0.014454
C  1.639975 -2.599848 0.024493
C  0.261606 -2.745311 0.020925
C  -0.836702 0.869049 -0.046229
C  -2.006738 -1.716134 0.000654
C  -2.248862 0.744929 -0.02823
C  -2.854359 -0.582053 -0.012469
C  -3.11319 1.898136 -0.019107
C  -4.291047 -0.692352 0.001711
C  -4.497498 1.75475 -0.004671
C  -5.093436 0.444779 0.004141
H  1.554669 1.807854 -1.011493
H  3.676743 0.898014 -1.667485
H  4.146316 0.418689 1.339828
H  5.417169 0.212063 0.088116
H  4.184904 -1.973825 0.686293
H  4.154978 -1.565371 -1.036424
H  2.285504 -3.485892 0.068445
H  -0.193613 -3.742209 0.055502
H  -0.397279 1.870717 -0.010752
H  -2.45108 -2.719276 0.028867
H  2.550131 2.726443 1.003347
H  5.041128 2.589563 -0.446897
H  -2.658363 2.895803 -0.02336
H  -4.743231 -1.691498 0.012592
H  -5.143683 2.639485 0.001336
H  -6.184984 0.350454 0.015237
