program: Gaussian 09
title: 000176531
version: EM64L-G09RevD.01
frameworkgroup: C1[X(C15H16Cl2N2O4)]
method: RPBEPBE
basis: SDD
operation: Freq
keyword: #p
keyword: freq=noraman
keyword: PBEPBE/SDD
title: #p freq=noraman PBEPBE/SDD
converged: YES YES NO NO
title: Mulliken charges:
elementType: Cl Cl O O O O N N C C C C C C C C C C C C C C C H H H H H H H H H H H H H H H H
charge: -0.036927 -0.034540 -0.258704 -0.213108 -0.176334 -0.190211 -0.232189 -0.361292 -0.469158 -0.078798 0.279069 0.175279 -0.254776 0.211483 -0.309453 0.522575 -0.693188 -0.699895 -0.321369 -0.318949 -0.073295 -0.076346 -0.250797 0.296435 0.297592 0.219290 0.194522 0.183060 0.239323 0.233698 0.209448 0.191941 0.257485 0.223969 0.211364 0.205036 0.306757 0.303427 0.287578
chargesum: 0.00000
title: Mulliken charges with hydrogens summed into heavy atoms:
elementType: Cl Cl O O O O N N C C C C C C C C C C C C C C C
charge: -0.036927 -0.034540 -0.258704 -0.213108 -0.176334 -0.190211 -0.232189 -0.361292 0.124869 0.140493 0.279069 0.175279 0.122805 0.211483 0.163568 0.522575 -0.034314 -0.059527 -0.014611 -0.015521 -0.073295 -0.076346 0.036781
polarizability: 2.96350906e+02 -3.60904144e+00 2.31861285e+02 -1.46854691e+01 -4.60102175e+00 1.20954654e+02
1716.lowfreq: -8.4210 -0.0012 0.0009 0.0014 1.1865 3.0068 11.1141 14.5443 29.2509
frequency: 10.0824 13.9081 29.2151 34.8435 46.5358 60.2533 78.9469 112.6615 122.7555 125.1583 131.3427 149.8741 160.2319 167.9410 194.6246 197.7836 210.2511 229.2251 242.0132 251.0505 261.0309 271.6106 303.5023 337.7907 372.0915 375.3894 383.9262 412.3614 429.5959 446.6072 483.3620 493.9326 510.9184 539.3838 556.8008 588.0178 602.2076 660.6903 678.4328 700.6772 715.6526 753.3670 759.5094 825.1673 860.6432 867.1141 872.2118 878.3857 907.8403 922.0893 935.8121 959.0095 970.7666 977.4960 982.6562 990.0725 992.7520 1017.3237 1086.2263 1096.1749 1112.8082 1115.8413 1138.0426 1150.2288 1166.0030 1168.1739 1191.3496 1207.2355 1208.4730 1229.2873 1233.9830 1268.1160 1294.8147 1320.9114 1341.5976 1343.8520 1352.7187 1375.7909 1378.8558 1391.3313 1405.9547 1421.8510 1427.6107 1445.5510 1454.2705 1464.6823 1469.4288 1477.6115 1481.9606 1491.2204 1568.0138 1599.0571 1637.7581 1653.9707 1703.7586 2910.2154 2924.3873 2960.7326 2965.7040 2971.0025 2974.3967 2999.4170 3030.4677 3061.0644 3068.2324 3078.1833 3085.9653 3097.3380 3190.2018 3207.5191 3209.1285
redmass: 4.3028 3.7927 6.1646 5.3480 10.3138 6.0985 6.5762 5.7701 4.7836 3.8563 4.8230 2.9632 12.0571 5.4310 1.1085 4.6086 3.4711 1.8283 2.1478 3.0484 6.8325 10.2673 6.7451 4.0818 2.8534 6.6446 11.5847 8.5078 2.1681 5.2772 4.9858 5.7702 5.1292 3.7821 3.1738 4.4528 9.1696 2.5876 5.9752 5.3858 9.5815 7.3820 9.8080 2.8225 1.8172 2.3981 1.3986 1.9354 1.5865 1.2808 1.8479 2.1008 1.8217 6.4335 1.9431 5.6078 2.0610 4.6301 5.2484 2.9429 2.2572 1.9530 2.0294 1.7310 5.0717 1.1162 1.7603 1.0900 4.5450 4.0663 1.2840 1.2116 1.3520 2.5177 1.4769 3.0834 1.5157 10.3930 1.2149 1.3056 1.3552 2.9270 1.1229 3.0051 1.1487 1.0605 1.0463 1.0739 1.0504 1.0581 7.4780 7.1402 10.3303 11.6787 12.5997 1.0550 1.0560 1.1000 1.1023 1.0362 1.0386 1.0871 1.0598 1.0989 1.0987 1.0988 1.1036 1.0991 1.0940 1.0930 1.0939
irintensity: 0.3432 0.1728 0.0911 0.2816 0.3966 0.0489 0.1069 8.2486 6.8863 0.2919 3.9117 9.5423 0.5456 2.5543 0.6172 0.1463 0.0782 0.7742 0.2100 3.3008 4.1396 7.6662 1.1869 1.4326 3.2728 5.6473 12.1162 8.9625 2.1608 1.5518 1.6599 4.7620 0.0591 0.4087 5.4785 1.3445 35.6199 23.4643 10.8876 89.4160 8.4569 12.7783 73.8064 3.1383 54.6020 3.2288 0.5161 17.5811 15.2900 2.2601 12.1572 10.5708 7.5241 20.6755 1.0267 17.3112 2.1995 190.0321 22.3933 190.7304 54.7968 10.3068 20.9174 8.2264 58.4048 1.5868 3.8952 1.0484 275.9700 646.3092 6.6620 0.4184 3.6047 27.4206 5.3509 326.3480 36.5840 1.8629 20.5946 4.9260 32.5955 76.2454 25.6117 146.3488 19.5675 6.1603 2.0045 8.6722 11.0611 28.3482 93.0181 134.3569 130.7021 607.4958 30.0734 51.1843 66.6885 50.2722 12.1519 34.6561 29.7287 30.5352 5.7397 19.1263 73.3432 54.2820 0.3723 24.5641 2.2924 6.9723 2.9184
temp: 298.150 k
press: 1.00000 atm
elementType: 17 17 8 8 8 8 7 7 6 6 6 6 6 6 6 6 6 6 6 6 6 6 6 1 1 1 1 1 1 1 1 1 1 1 1 1 1 1 1
symmnumber: 1
zpe: 758273.1 jmol-1
zpe.correction: 0.288811 hartree
zpe.thermalcorrener: 0.312242 hartree
zpe.thermalcorrenthalpy: 0.313186 hartree
zpe.thermalcorrgfe: 0.231496 hartree
zpe.sumelectzpe: -1910.031594 hartree
zpe.sumelectthermal: -1910.008163 hartree
zpe.sumelectthermalent: -1910.007218 hartree
zpe.sumelectthermalfe: -1910.088909 hartree
dipole: 1.1114 1.6395 0.4309
dipole: 2.0270
quadrupole: -158.9892 -158.3162 -147.2516
quadrupole: 7.5603 1.3002 -2.4986
quadrupole: -4.1369 -3.4639 7.6008 7.5603 1.3002 -2.4986
hfenergy: -1910.3204047 hartree
pointgroup: C01 [X(C15H16Cl2N2O4)]
dipole: 0.4477637 -0.6495611 -0.11648 debye
polarizability: 295.7857223|5.7191058|230.759419|16.907432|-12.2665106|122.6217045 unknown
InChI: InChI=1S/C15H16Cl2N2O4/c1-9(2)7-23-8-14(21)18-6-13(20)19(15(18)22)12-4-10(16)3-11(17)5-12/h3-5,9H,6-8H2,1-2H3
charge 0 multiplicity 1
39 atoms
Cl -3.920126 -3.786341 1.004021
Cl -6.516637 0.569169 -1.251628
O  4.270303 0.075861 -0.207887
O  0.131236 -1.000898 -0.192095
O  -2.376476 2.954504 0.466038
O  2.810413 2.32929 0.221586
N  0.762204 1.276868 0.135415
N  -1.464086 0.768834 0.119723
C  0.069629 2.560944 0.349911
C  6.494068 -0.892016 -0.414908
C  -0.143871 0.204203 0.000511
C  -1.407433 2.180037 0.326129
C  4.988622 -1.199225 -0.385352
C  2.193476 1.250187 0.076553
C  2.839322 -0.113169 -0.157646
C  -2.673154 -0.007807 0.036937
C  6.956133 -0.243171 0.909227
C  7.283717 -2.185506 -0.724228
C  -3.841437 0.587284 -0.502623
C  -2.688829 -1.345833 0.504917
C  -3.890433 -2.067793 0.410761
C  -5.013873 -0.184772 -0.561096
C  -5.075483 -1.518922 -0.115226
H  0.30848 3.288751 -0.444564
H  0.347069 3.018875 1.314829
H  6.66044 -0.166535 -1.236296
H  4.66668 -1.68144 -1.335621
H  4.747999 -1.887594 0.457459
H  2.438987 -0.555568 -1.097333
H  2.534531 -0.807787 0.657675
H  8.025471 0.032542 0.858375
H  6.827683 -0.946234 1.755773
H  6.36909 0.666034 1.122353
H  8.366571 -1.973021 -0.776001
H  6.979196 -2.63177 -1.689766
H  7.129331 -2.943463 0.067956
H  -3.839931 1.621731 -0.846905
H  -1.790403 -1.81325 0.908411
H  -5.99828 -2.100005 -0.173983
