program: Gaussian 09
title: 000176410
version: EM64L-G09RevD.01
frameworkgroup: C1[X(C14H13NO2)]
method: RPBEPBE
basis: SDD
operation: Freq
keyword: #p
keyword: freq=noraman
keyword: PBEPBE/SDD
title: #p freq=noraman PBEPBE/SDD
converged: YES YES NO NO
title: Mulliken charges:
elementType: O O N C C C C C C C C C C C C C C H H H H H H H H H H H H H
charge: -0.337608 -0.270604 -0.375089 0.473410 -0.508981 -0.372314 -0.437821 -0.221015 -0.216392 -0.240110 0.385286 0.274499 -0.324976 -0.405407 -0.209308 -0.196328 -0.251731 0.265163 0.230433 0.247606 0.232604 0.329058 0.228889 0.228382 0.231062 0.303989 0.252182 0.227483 0.228927 0.228709
chargesum: 0.00000
title: Mulliken charges with hydrogens summed into heavy atoms:
elementType: O O N C C C C C C C C C C C C C C
charge: -0.337608 -0.270604 -0.046031 0.473410 -0.013384 -0.124707 -0.205217 0.007874 0.011990 -0.009048 0.385286 0.274499 -0.020987 -0.153225 0.018176 0.032599 -0.023022
polarizability: 2.45904295e+02 2.40526801e+00 1.34142036e+02 1.82106172e+01 -2.93869444e+00 1.07486912e+02
1716.lowfreq: -6.4687 -3.2850 0.0006 0.0006 0.0007 5.8689 17.4542 21.7291 27.2902
frequency: 17.1979 21.6414 27.0527 42.0489 64.9591 119.0963 185.1687 220.8900 236.5799 242.0267 291.4571 328.6905 404.1346 410.2518 412.4871 478.2698 498.3146 567.0262 597.1937 605.2432 613.8258 620.1478 684.1970 688.1996 694.3898 705.8169 747.6210 762.4011 776.1526 817.8852 841.5993 856.6783 903.1132 918.6926 921.3091 974.2285 980.1568 986.2804 990.2545 992.5979 997.7227 1014.8733 1025.4833 1027.2931 1077.0185 1082.0521 1095.2248 1161.4712 1169.4310 1173.1294 1184.1635 1189.8021 1204.3265 1215.2173 1240.3972 1311.9535 1315.8738 1356.3580 1383.5118 1388.6938 1441.8096 1443.0229 1469.0498 1475.6693 1485.4863 1488.0478 1592.5519 1596.0679 1608.9165 1615.7060 1678.0565 2979.9493 3042.6235 3116.8872 3125.3520 3130.6844 3136.9750 3141.3588 3148.0421 3158.6535 3164.9911 3171.7702 3205.7581 3567.8862
redmass: 3.8923 4.6856 4.7058 8.1337 6.5107 4.9338 3.8289 5.2852 5.4970 5.6922 3.1404 7.3067 2.8353 2.9652 3.0947 3.8522 3.0418 2.7250 4.1012 3.5995 2.6404 3.3899 9.0885 8.3745 2.4091 1.9382 1.9241 1.5189 3.7517 4.1982 1.2530 1.2479 2.5368 1.4041 1.7007 1.3561 1.3904 5.7213 6.1973 1.3114 1.3427 2.4807 2.1140 2.1662 2.1307 1.6362 2.3831 2.0248 1.0846 1.0541 1.3563 1.2646 2.1066 2.3877 1.2964 1.3301 1.3516 1.5088 9.1713 4.4942 2.2594 2.1599 2.0232 1.2997 1.9633 1.7166 6.4683 6.0787 6.3543 6.0234 9.9534 1.0636 1.0978 1.0874 1.0862 1.0852 1.0912 1.0902 1.0961 1.0948 1.1015 1.0997 1.0947 1.0774
irintensity: 0.0542 0.1095 0.3815 6.4779 0.3329 1.0781 1.9010 2.4830 9.2077 1.4603 4.8889 3.8374 2.0101 0.0846 4.2401 24.3296 6.3071 28.0783 25.6471 24.3123 50.1160 25.7595 9.5661 8.1904 48.4868 40.4376 37.5945 86.1272 26.3118 13.4528 0.0734 0.2863 43.5433 11.4788 37.6645 0.1218 0.4745 2.4828 0.3661 2.1972 5.3102 25.2180 26.5159 50.2278 15.2355 6.9707 42.5093 551.1841 35.9682 0.4444 216.8190 131.9287 52.5608 9.3808 38.7986 3.9932 14.7464 5.4485 10.0580 4.3574 21.6936 15.8784 442.4985 25.3247 161.3771 0.8482 23.4419 0.4660 26.4076 5.0079 288.5708 43.5000 7.0577 8.4701 1.3330 0.3126 12.1491 17.7645 39.9887 29.9169 22.1396 11.8598 5.6245 40.9466
temp: 298.150 k
press: 1.00000 atm
elementType: 8 8 7 6 6 6 6 6 6 6 6 6 6 6 6 6 6 1 1 1 1 1 1 1 1 1 1 1 1 1
symmnumber: 1
zpe: 621128.6 jmol-1
zpe.correction: 0.236575 hartree
zpe.thermalcorrener: 0.251285 hartree
zpe.thermalcorrenthalpy: 0.252229 hartree
zpe.thermalcorrgfe: 0.190891 hartree
zpe.sumelectzpe: -745.298600 hartree
zpe.sumelectthermal: -745.283890 hartree
zpe.sumelectthermalent: -745.282946 hartree
zpe.sumelectthermalfe: -745.344285 hartree
dipole: -1.6336 1.4001 -1.6126
dipole: 2.6888
quadrupole: -81.4386 -97.1674 -98.7306
quadrupole: 2.2696 3.5327 2.3745
quadrupole: 11.0070 -4.7219 -6.2851 2.2696 3.5327 2.3745
hfenergy: -745.5351755 hartree
pointgroup: C01 [X(C14H13N1O2)]
dipole: -0.636155 -0.4072637 0.7406023 debye
polarizability: 244.4061307|-9.3416625|132.6918031|-21.2981748|-6.684061|110.4353094 unknown
InChI: InChI=1S/C14H13NO2/c16-14(17-13-9-5-2-6-10-13)15-11-12-7-3-1-4-8-12/h1-10,15H,11H2
charge 0 multiplicity 1
30 atoms
O  1.492543 -0.061923 0.565941
O  0.75197 1.478173 -1.107833
N  -0.633307 0.673286 0.608275
C  -3.077096 0.537888 0.113279
C  -1.837762 1.421597 0.221409
C  -3.027537 -0.702939 -0.572207
C  -4.306278 0.964411 0.672771
C  -4.187364 -1.498203 -0.698046
C  -5.470252 0.171997 0.544007
C  -5.413585 -1.062632 -0.141602
C  2.853551 -0.203194 0.165414
C  0.548605 0.778513 -0.085877
C  3.488315 0.530669 -0.864032
C  3.558493 -1.166653 0.92283
C  4.8564 0.277901 -1.120824
C  4.921655 -1.402451 0.649579
C  5.578651 -0.680194 -0.374979
H  -1.603447 1.893916 -0.751047
H  -2.025594 2.241539 0.942798
H  -2.079001 -1.041252 -1.005734
H  -4.354529 1.919251 1.211452
H  -0.654734 0.063238 1.426528
H  -4.137671 -2.454121 -1.23152
H  -6.414901 0.514257 0.981226
H  -6.313314 -1.680126 -0.240053
H  2.929976 1.265349 -1.445082
H  3.030717 -1.712491 1.710767
H  5.355783 0.841825 -1.916661
H  5.467829 -2.148705 1.236835
H  6.637284 -0.862926 -0.587714
