program: Gaussian 09
title: 000175484
version: EM64L-G09RevD.01
frameworkgroup: C1[X(C14H14ClN)]
method: RPBEPBE
basis: SDD
operation: Freq
keyword: #p
keyword: freq=noraman
keyword: PBEPBE/SDD
title: #p freq=noraman PBEPBE/SDD
converged: YES YES NO NO
title: Mulliken charges:
elementType: Cl N C C C C C C C C C C C C C C H H H H H H H H H H H H H H
charge: -0.056504 -0.000041 -0.541640 0.613812 -0.356563 0.399817 -0.588059 -0.346751 0.333475 -0.408083 -0.685365 -0.225827 -0.331465 -0.329658 -0.347512 -0.350640 0.207927 0.224864 0.223861 0.209307 0.249326 0.247241 0.209185 0.215743 0.223883 0.255977 0.236191 0.236576 0.240683 0.240240
chargesum: 0.00000
title: Mulliken charges with hydrogens summed into heavy atoms:
elementType: Cl N C C C C C C C C C C C C C C
charge: -0.056504 -0.000041 -0.108849 0.613812 0.076605 0.399817 -0.338733 -0.346751 0.333475 -0.160842 -0.036554 0.030150 -0.095274 -0.093082 -0.106829 -0.110400
polarizability: 2.60368684e+02 1.27013087e+01 1.59125135e+02 8.88490633e+00 -1.96380806e+01 9.82707874e+01
1716.lowfreq: -11.0588 -0.0003 0.0015 0.0024 3.7380 8.5679 41.5991 44.8114 61.7473
frequency: 41.5692 44.7786 61.7386 94.5583 99.1986 107.4963 160.8784 225.0016 243.2488 249.0032 266.2484 291.5457 306.5828 363.7471 370.7812 426.4731 461.2790 476.8859 531.8565 579.4807 633.3524 639.9124 662.4363 712.6328 738.2309 746.9141 748.5118 812.1062 836.5144 862.8316 873.3140 877.9282 903.5183 917.2657 952.0892 961.9563 962.6821 973.0502 1013.6192 1043.9243 1053.4337 1062.8277 1084.3685 1089.6663 1093.4350 1154.2997 1198.6547 1224.1101 1226.5863 1272.6877 1282.5295 1288.4567 1292.2221 1311.1196 1326.6518 1341.3979 1367.8389 1390.6142 1396.4783 1410.7957 1456.1250 1470.0722 1476.0839 1478.0102 1483.3030 1488.5584 1539.7552 1579.3017 1587.3409 1603.6673 2975.2005 2984.4358 2993.5739 3031.0489 3055.0487 3076.0666 3077.8181 3127.8722 3129.4403 3130.7008 3144.6235 3153.8276 3159.3026 3171.9429
redmass: 3.9231 3.7611 7.1115 1.9676 5.0978 2.8593 6.2183 1.8213 2.0358 7.1504 3.1734 4.0270 3.9873 4.2915 2.5210 4.2115 4.0260 4.1319 3.8571 4.1762 4.6434 7.2261 6.9398 4.9238 4.0395 1.2252 2.4654 1.3252 1.5309 2.3010 1.3194 1.2567 2.7094 1.5823 1.4511 4.1912 1.4180 1.5505 5.2135 3.1815 2.7692 1.9996 1.5859 1.6125 2.1366 1.4452 1.9097 1.3216 1.3041 1.4157 1.3718 3.0434 1.1883 2.3856 1.8590 1.4330 3.7364 1.2140 3.1264 2.4638 2.0926 1.1573 1.0660 1.0793 2.0353 1.1260 6.8828 7.0610 5.7965 6.4461 1.0356 1.0597 1.0610 1.0989 1.1026 1.1014 1.0999 1.0887 1.0884 1.0898 1.0892 1.0950 1.0981 1.0964
irintensity: 0.0786 0.1510 0.7752 0.5365 1.1870 0.4698 0.2203 0.1894 0.0265 0.5455 2.3002 2.7017 0.0829 0.1661 0.1331 9.7061 17.2547 7.5617 11.7386 6.0235 0.3521 0.2242 1.2896 11.2871 4.6649 6.6284 1.7591 96.5967 10.2766 3.0356 0.7125 0.0540 8.2481 3.2962 1.7876 1.2185 0.0524 0.3547 55.2056 17.5840 6.7923 1.1629 13.7552 0.4190 22.7220 3.3654 0.9902 0.1308 4.1030 0.4716 1.1294 4.1296 1.2211 1.0720 1.0670 1.8356 0.6407 10.8327 14.7275 10.6500 74.6325 1.3221 3.1420 16.1201 10.4881 19.8565 18.1610 0.8762 90.0027 9.7307 40.9738 2.4209 50.9517 0.5278 1.7032 62.4157 47.3536 18.1432 13.5348 8.6476 3.0215 38.4140 0.4930 4.7330
temp: 298.150 k
press: 1.00000 atm
elementType: 17 7 6 6 6 6 6 6 6 6 6 6 6 6 6 6 1 1 1 1 1 1 1 1 1 1 1 1 1 1
symmnumber: 1
zpe: 631128.4 jmol-1
zpe.correction: 0.240384 hartree
zpe.thermalcorrener: 0.255035 hartree
zpe.thermalcorrenthalpy: 0.255979 hartree
zpe.thermalcorrgfe: 0.197313 hartree
zpe.sumelectzpe: -1055.562837 hartree
zpe.sumelectthermal: -1055.548187 hartree
zpe.sumelectthermalent: -1055.547242 hartree
zpe.sumelectthermalfe: -1055.605908 hartree
dipole: -1.7038 0.1627 0.0742
dipole: 1.7132
quadrupole: -122.6718 -93.7656 -101.9469
quadrupole: -9.3777 0.6068 -5.7618
quadrupole: -16.5437 12.3625 4.1812 -9.3777 0.6068 -5.7618
hfenergy: -1055.8032213 hartree
pointgroup: C01 [X(C14H14Cl1N1)]
dipole: 0.671968 0.0437148 -0.0291026 debye
polarizability: 259.5047711|-15.779237|159.8739828|9.4234882|19.5432885|98.3858521 unknown
InChI: InChI=1S/C14H14ClN/c1-2-3-13-10-12(4-5-14(13)15)11-6-8-16-9-7-11/h4-10H,2-3H2,1H3
charge 0 multiplicity 1
30 atoms
Cl 3.863537 -1.939377 0.234425
N  -4.721622 0.808438 -0.064374
C  2.939184 1.079922 0.553104
C  1.855796 0.035529 0.356118
C  3.54904 1.572063 -0.791177
C  -0.559583 -0.511653 0.077283
C  0.491101 0.415528 0.30266
C  2.1326 -1.341755 0.175616
C  -1.978603 -0.06219 0.031101
C  -0.221123 -1.880694 -0.097569
C  4.653072 2.6272 -0.571935
C  1.123352 -2.298039 -0.046512
C  -2.940549 -0.711181 -0.79068
C  -2.441111 1.037901 0.804561
C  -4.274515 -0.251287 -0.804079
C  -3.793805 1.431064 0.724053
H  2.518473 1.949896 1.09296
H  3.754489 0.669128 1.17783
H  3.962289 0.704698 -1.340034
H  2.742207 1.993377 -1.422344
H  0.25441 1.480463 0.414294
H  -1.007318 -2.629708 -0.238755
H  4.260014 3.512712 -0.037563
H  5.484222 2.212462 0.028493
H  5.071598 2.972084 -1.534737
H  1.384953 -3.353206 -0.16571
H  -2.653031 -1.547151 -1.436652
H  -1.766334 1.567345 1.485168
H  -5.02522 -0.739386 -1.435999
H  -4.164724 2.274616 1.317352
