program: Gaussian 09
title: 000175468
version: EM64L-G09RevD.01
frameworkgroup: C1[X(C12H23BrO2)]
method: RPBEPBE
basis: SDD
operation: Freq
keyword: #p
keyword: freq=noraman
keyword: PBEPBE/SDD
title: #p freq=noraman PBEPBE/SDD
converged: YES YES NO NO
title: Mulliken charges:
elementType: Br O O C C C C C C C C C C C C H H H H H H H H H H H H H H H H H H H H H H H
charge: -0.051234 -0.417939 -0.230817 -0.385514 -0.383791 -0.383465 -0.385163 -0.377943 -0.368917 -0.376962 -0.376261 -0.313406 -0.487868 -0.694884 0.170996 0.195890 0.195965 0.193773 0.193755 0.194482 0.194354 0.196979 0.197120 0.198054 0.198179 0.191689 0.191385 0.198114 0.197838 0.219311 0.217023 0.226928 0.226793 0.252423 0.251930 0.277919 0.277879 0.375387
chargesum: 0.00000
title: Mulliken charges with hydrogens summed into heavy atoms:
elementType: Br O O C C C C C C C C C C C C
charge: -0.051234 -0.042553 -0.230817 0.006341 0.003737 0.005371 0.008936 0.018289 0.014157 0.018989 0.060073 0.140316 0.016485 -0.139086 0.170996
polarizability: 2.23403031e+02 -1.08260893e+01 1.32107948e+02 7.61521381e-02 3.34075596e-02 1.06973093e+02
1716.lowfreq: -2.5477 -0.0007 0.0007 0.0012 5.5854 12.5175 16.3546 19.3633 36.6959
frequency: 16.3424 19.3574 31.8822 40.6652 58.2900 60.9800 71.5463 93.7556 100.7498 106.9817 128.9339 132.2718 139.1172 157.1096 160.1681 179.2857 243.0663 271.0309 355.3219 372.3710 448.6223 470.3695 499.4605 506.4244 588.4021 616.9607 635.5688 724.2697 725.5524 732.7623 745.5747 766.0585 803.3758 852.3379 856.7063 908.2424 964.6762 980.1575 983.3531 1011.6049 1015.2563 1025.3356 1042.1193 1055.0795 1062.3603 1070.9894 1078.2648 1082.5969 1084.1497 1106.9852 1116.9311 1189.5201 1197.9067 1213.9064 1217.9685 1235.6645 1240.9096 1253.4274 1265.5015 1277.0174 1281.4077 1282.3380 1291.7965 1294.0545 1301.7432 1301.8452 1302.2846 1324.4285 1341.0832 1351.6076 1356.8661 1359.6513 1372.6596 1437.8702 1450.6258 1461.8263 1462.0426 1465.0716 1466.1699 1468.9984 1474.7989 1481.4383 1487.0258 1490.3505 1669.3447 2951.3391 2952.2466 2953.4138 2957.1702 2959.5098 2964.8405 2969.4547 2985.7036 2986.5988 2990.3942 2996.4188 2996.6807 2998.3360 3004.8872 3017.9911 3029.2621 3034.5519 3043.6737 3046.8361 3061.1885 3062.8289 3131.8888 3512.8575
redmass: 6.9447 6.6834 3.7040 3.6176 5.0232 1.8250 2.9163 1.7947 8.0695 2.3986 1.9148 5.3372 2.1785 2.0123 2.0716 4.9896 5.2695 4.1896 4.2545 3.8476 3.6046 3.4324 1.8320 3.0087 4.6752 4.8517 1.3290 1.0617 1.0790 1.0984 1.1157 1.1853 1.2624 1.3047 4.8139 1.2992 1.2542 5.6173 5.0297 4.1805 1.1659 3.6985 3.3383 1.0455 2.7974 2.9344 2.3264 2.1823 2.4232 3.9856 1.4412 1.7714 1.1949 1.5050 1.2511 1.3438 1.3607 1.3738 1.2561 1.3616 1.0251 1.1312 1.0860 1.0941 1.2777 1.1226 1.1689 1.4194 1.4722 1.5554 1.6602 1.6329 1.8299 1.0843 1.1029 1.0714 1.0749 1.0653 1.0702 1.0836 1.0957 1.0993 1.1006 1.1007 8.2365 1.0588 1.0586 1.0590 1.0592 1.0591 1.0591 1.0585 1.0963 1.0613 1.0978 1.0678 1.0911 1.0595 1.1021 1.1040 1.1012 1.1032 1.1047 1.0562 1.1042 1.1032 1.1112 1.0639
irintensity: 0.0079 0.1819 0.0019 0.1921 1.1447 0.2452 0.6534 0.2717 0.0136 0.0299 0.0050 0.2156 0.2030 0.0143 0.0033 4.3376 3.5548 0.2373 0.3333 0.8804 18.3088 8.8034 27.9673 15.6068 11.4377 40.7778 127.8345 20.7030 0.0329 10.5004 1.1929 6.3987 0.2130 2.8269 1.2833 0.0529 1.5331 30.2289 9.9381 75.3319 0.2793 4.8824 136.3372 1.2707 17.1535 21.1640 7.6078 5.1000 0.3736 11.1096 0.8843 0.1428 26.0231 0.1216 33.7844 8.5982 0.5396 2.9677 0.1226 40.5703 0.1164 0.8272 0.0076 0.0053 0.6188 0.1220 0.3492 37.8566 1.6930 3.9078 3.1044 3.7417 29.4175 27.5949 2.7157 0.0059 0.0346 0.0712 1.4233 1.0310 0.3627 4.5707 0.1443 37.4831 208.3535 1.1109 1.0286 5.0344 0.7380 3.2793 22.0316 188.3307 0.7749 5.2344 0.3739 31.2817 10.9290 27.1807 0.0114 4.6728 1.5614 0.0265 152.5168 25.0685 54.7451 106.5936 19.2613 18.0949
temp: 298.150 k
press: 1.00000 atm
elementType: 35 8 8 6 6 6 6 6 6 6 6 6 6 6 6 1 1 1 1 1 1 1 1 1 1 1 1 1 1 1 1 1 1 1 1 1 1 1
symmnumber: 1
zpe: 867155.0 jmol-1
zpe.correction: 0.330282 hartree
zpe.thermalcorrener: 0.349754 hartree
zpe.thermalcorrenthalpy: 0.350698 hartree
zpe.thermalcorrgfe: 0.276792 hartree
zpe.sumelectzpe: -633.765032 hartree
zpe.sumelectthermal: -633.745561 hartree
zpe.sumelectthermalent: -633.744616 hartree
zpe.sumelectthermalfe: -633.818523 hartree
dipole: 2.3673 -2.5778 -0.0048
dipole: 3.4999
quadrupole: -134.6825 -109.2139 -101.3311
quadrupole: -4.3683 -0.3681 -0.1804
quadrupole: -19.6067 5.8619 13.7447 -4.3683 -0.3681 -0.1804
hfenergy: -634.0953143 hartree
pointgroup: C01 [X(C12H23Br1O2)]
dipole: -0.9036571 -1.037582 0.0536638 debye
polarizability: 222.7504158|13.2793693|132.6887823|-0.2571028|-1.3431204|107.0448748 unknown
InChI: InChI=1S/C12H23BrO2/c13-11-9-7-5-3-1-2-4-6-8-10-12(14)15/h14H,1-11H2
charge 0 multiplicity 1
38 atoms
Br 9.181189 0.665661 -0.018347
O  -7.751139 -0.650799 0.020091
O  -6.746222 1.434009 -0.15636
C  1.079436 0.309381 -0.021242
C  -0.203313 -0.552069 0.000292
C  2.37751 -0.529008 0.001183
C  -1.501636 0.285461 -0.023302
C  3.659531 0.333397 -0.020081
C  -2.783751 -0.576743 -0.000415
C  4.956445 -0.508691 0.004782
C  -4.076324 0.267942 -0.030445
C  6.232073 0.374128 -0.017986
C  -5.342889 -0.608196 -0.001424
C  7.496882 -0.484423 0.012613
C  -6.62822 0.193546 -0.055587
H  1.072771 0.998209 0.849215
H  1.073764 0.952483 -0.926041
H  -0.195981 -1.241504 -0.869934
H  -0.197761 -1.194665 0.905701
H  2.383557 -1.217535 -0.869626
H  2.38233 -1.171945 0.90622
H  -1.508775 0.975688 0.845848
H  -1.507853 0.927104 -0.928939
H  3.653528 1.02208 0.849948
H  3.656285 0.974509 -0.925775
H  -2.777485 -1.215603 0.907784
H  -2.772793 -1.269348 -0.868288
H  4.962612 -1.196711 -0.865819
H  4.960149 -1.147505 0.912178
H  -4.089971 0.90368 -0.936342
H  -4.090685 0.96389 0.830293
H  6.231856 1.005148 -0.926854
H  6.225946 1.059333 0.850723
H  -5.373369 -1.238125 0.909224
H  -5.353728 -1.318394 -0.852174
H  7.593297 -1.134675 -0.871014
H  7.587747 -1.077938 0.935886
H  -8.577311 -0.09627 -0.023187
