program: Gaussian 09
title: 000175439
version: EM64L-G09RevD.01
frameworkgroup: C1[X(C23H24BrN5O5S)]
method: RPBEPBE
basis: SDD
operation: Freq
keyword: #p
keyword: freq=noraman
keyword: PBEPBE/SDD
title: #p freq=noraman PBEPBE/SDD
converged: YES YES NO NO
title: Mulliken charges:
elementType: Br S O O O O O N N N N N C C C C C C C C C C C C C C C C C C C C C C C H H H H H H H H H H H H H H H H H H H H H H H H
charge: 0.017007 0.281795 -0.255025 -0.256114 -0.273804 -0.268403 -0.269125 -0.142176 -0.432079 -0.103055 -0.053979 0.021972 -0.456294 -0.468061 0.511660 -0.301688 -0.300499 -0.492592 -0.355447 0.324330 -0.047392 -0.278039 0.209842 0.315177 0.315064 -0.777400 -0.390378 -0.349118 0.370638 -0.767302 -0.767324 -0.214690 -0.316811 -0.226398 -0.165357 0.297701 0.238395 0.294681 0.257003 0.248375 0.239674 0.257804 0.245160 0.314625 0.228704 0.277751 0.363481 0.255103 0.255134 0.235210 0.249194 0.246210 0.291870 0.249618 0.247301 0.285677 0.266605 0.262183 0.253600
chargesum: 0.00000
title: Mulliken charges with hydrogens summed into heavy atoms:
elementType: Br S O O O O O N N N N N C C C C C C C C C C C C C C C C C C C C C C C
charge: 0.017007 0.281795 -0.255025 -0.256114 -0.273804 -0.268403 -0.269125 -0.142176 -0.068597 -0.103055 -0.053979 0.021972 0.079803 0.083623 0.511660 0.186362 0.202465 -0.177967 -0.126742 0.324330 -0.047392 -0.000287 0.209842 0.315177 0.315064 -0.031953 -0.390378 -0.349118 0.370638 0.019973 0.015273 0.051915 -0.054628 -0.226398 0.088243
polarizability: 1.04052498e+03 5.84208152e+00 3.33127024e+02 -3.46394835e+00 -2.52007016e+01 1.80163080e+02
1716.lowfreq: -5.1816 -0.0014 -0.0009 0.0007 0.2645 3.2142 11.0146 15.5555 18.8481
frequency: 10.8775 15.5255 18.8424 23.3528 26.4013 43.8325 50.8574 54.9801 61.0698 64.1745 74.4365 81.6590 83.3908 90.7695 93.0251 96.9394 101.0989 107.1477 108.7526 114.1130 124.1250 141.9295 157.8158 189.2429 192.3264 196.9799 220.2943 236.4883 264.5210 270.5763 274.2970 281.3153 288.9236 308.3550 322.5350 351.2198 359.2274 378.5385 386.4841 394.7290 409.2229 419.0809 436.3784 450.9478 465.6191 480.3977 496.6255 502.1984 518.5918 535.9435 552.8186 557.3468 576.0920 578.2585 585.6347 606.7677 608.5603 616.6627 624.5254 634.3447 646.5000 652.9293 667.0341 709.2639 728.9887 751.0319 754.1262 755.5703 758.3700 809.4095 819.8818 821.8943 840.6332 868.0144 871.7496 885.8129 894.8180 904.0993 907.7611 913.0371 935.2935 957.0383 959.9794 975.0626 983.1302 994.1899 1005.3359 1005.7091 1013.5105 1023.7118 1038.1696 1044.6184 1046.8303 1052.8842 1055.2253 1069.2959 1071.3317 1101.8116 1126.0813 1137.4453 1170.8745 1187.8012 1192.4315 1200.7768 1225.6085 1234.7346 1241.1487 1242.9730 1258.1955 1264.6423 1277.8626 1294.3687 1297.7953 1332.6863 1345.3415 1352.1967 1354.1366 1363.8669 1365.2593 1377.1257 1384.6080 1389.2564 1389.7793 1391.3320 1393.4742 1418.3886 1439.0503 1442.2463 1445.1783 1452.8390 1453.1238 1455.5520 1459.7253 1462.5727 1463.1778 1472.9267 1479.9147 1498.5761 1502.2453 1521.9270 1538.1833 1551.6261 1590.0282 1605.5058 1627.8390 1632.4170 1638.9711 2996.6324 2997.8665 3000.1355 3022.6182 3030.7053 3035.2156 3040.7442 3093.4114 3093.9347 3094.3117 3096.9889 3100.5976 3108.0723 3117.7141 3127.7392 3139.5552 3140.0161 3154.5087 3162.8701 3174.8973 3175.2884 3182.7441 3200.2390 3350.9008
redmass: 8.3132 6.5860 8.9117 5.2792 7.9764 5.7035 4.4717 5.9984 1.1743 8.1061 6.5575 4.4242 4.6446 4.0962 3.9359 4.6886 1.2030 2.8019 1.2225 5.5718 7.2644 6.7217 5.2933 5.9041 7.1861 7.0469 9.0053 6.0907 6.4911 8.1500 4.3381 4.2667 3.8000 3.4917 6.2969 5.8416 4.0222 4.0850 3.1242 6.2125 3.9010 3.7016 3.3886 4.4541 2.8656 3.3961 4.5418 7.4514 2.1078 4.3092 3.4604 4.6374 3.3559 3.3478 3.2870 6.3119 6.9573 3.9654 4.2839 7.3483 4.9858 4.2623 5.5269 8.8063 4.1297 3.9738 4.6226 5.8904 4.5137 1.6597 3.3117 1.5021 7.2470 1.3783 3.2897 1.1230 3.2278 1.8208 1.8239 6.7061 6.1309 1.3459 2.6115 1.3294 2.0162 2.1133 1.9862 1.7892 3.1087 4.2523 3.2479 1.6361 2.7031 1.6289 1.6309 5.5117 2.1640 2.3544 1.5547 1.8954 2.5828 2.3538 2.2270 3.3353 1.8270 1.7823 1.7518 1.2706 1.8020 1.3172 1.2551 2.6307 1.8876 5.0684 1.2660 2.5705 1.6049 1.2845 1.3114 3.5719 2.4241 1.2838 1.2335 1.4212 2.7149 4.2447 1.0971 1.1040 6.0546 1.0474 1.0536 1.0533 1.0683 1.4733 1.0909 1.6556 1.2220 1.9413 1.8598 2.7743 7.0442 3.9350 7.6806 4.9058 6.5429 9.3316 9.1830 1.0403 1.0399 1.0358 1.0611 1.0615 1.0631 1.0628 1.0949 1.0923 1.0974 1.0977 1.1010 1.1016 1.1042 1.1043 1.1022 1.1023 1.0866 1.0884 1.0963 1.0932 1.0977 1.0915 1.0772
irintensity: 0.0026 0.0134 0.0383 0.0604 0.1523 0.4892 0.3324 0.5919 1.5749 0.3398 2.8080 2.1761 11.6139 1.2405 4.1739 1.4995 2.7204 1.4109 1.9731 1.6566 1.5340 1.1856 15.9115 1.0375 6.8880 7.8765 12.5119 1.4265 9.7758 0.5644 1.5226 1.2485 20.7153 7.3977 1.3685 1.1310 1.3984 1.9718 9.3853 0.4416 4.9715 7.5815 11.6313 20.2097 0.8804 17.3236 17.6261 3.9452 22.2065 5.4750 13.9597 4.6182 5.0416 2.9896 1.2841 10.9110 2.0184 52.8844 13.3049 57.8470 4.8248 2.4956 29.0810 22.8497 0.0100 7.6439 39.6116 8.4832 14.5906 33.3706 0.3288 44.3968 30.5514 17.8032 3.0040 46.0409 109.7138 70.0553 13.5377 28.8547 11.7532 0.5153 91.1962 4.0818 66.0010 3.7033 263.9307 30.7782 3.2212 55.2652 68.4432 17.4628 4.1022 32.3001 2.1358 384.8980 5.9509 26.9976 22.1876 36.3064 28.7522 12.8014 23.9915 1528.0339 69.1078 56.8581 29.8010 11.8544 20.4062 197.5158 18.3713 39.9211 167.6158 1002.8360 8.6071 149.0694 13.6113 20.4141 5.0953 152.0632 274.5914 33.5173 71.5317 44.8186 23.7633 4.4230 9.6019 17.0343 3.9014 19.3074 20.3348 1.5911 19.8492 286.0026 48.2925 161.6542 33.6552 10.7604 129.6861 124.7149 85.7005 410.7474 141.7954 59.7140 1133.4702 62.7769 236.7203 5.3961 2.4802 4.8730 12.8013 6.4740 31.8176 20.1455 4.9897 9.0994 0.5772 6.9613 1.1988 13.1365 16.2877 12.1613 7.1617 6.4811 7.0515 0.7995 22.0865 1.2335 8.0635 11.2996 88.6737
temp: 298.150 k
press: 1.00000 atm
elementType: 35 16 8 8 8 8 8 7 7 7 7 7 6 6 6 6 6 6 6 6 6 6 6 6 6 6 6 6 6 6 6 6 6 6 6 1 1 1 1 1 1 1 1 1 1 1 1 1 1 1 1 1 1 1 1 1 1 1 1
symmnumber: 1
zpe: 1161530.7 jmol-1
zpe.correction: 0.442404 hartree
zpe.thermalcorrener: 0.477618 hartree
zpe.thermalcorrenthalpy: 0.478562 hartree
zpe.thermalcorrgfe: 0.368927 hartree
zpe.sumelectzpe: -1949.700744 hartree
zpe.sumelectthermal: -1949.665530 hartree
zpe.sumelectthermalent: -1949.664586 hartree
zpe.sumelectthermalfe: -1949.774220 hartree
dipole: 4.5097 -0.7649 0.0475
dipole: 4.5743
quadrupole: -224.9689 -212.1478 -221.2481
quadrupole: -18.2570 2.6693 0.8860
quadrupole: -5.5140 7.3072 -1.7932 -18.2570 2.6693 0.8860
hfenergy: -1950.1431474 hartree
pointgroup: C01 [X(C23H24Br1N5O5S1)]
dipole: -1.7802277 0.2630162 0.0212107 debye
polarizability: 1038.3539772|11.0424973|309.3529267|40.4824808|61.671166|206.1081835 unknown
InChI: InChI=1S/C23H24BrN5O5S/c1-14(30)25-21-13-18(29(8-10-33-15(2)31)9-11-34-16(3)32)5-7-19(21)27-28-23-26-20-6-4-17(24)12-22(20)35-23/h4-7,12-13,25H,8-11H2,1-3H3
charge 0 multiplicity 1
59 atoms
Br 11.135351 0.765143 0.872369
S  5.500072 2.111467 1.180911
O  -5.454255 2.37858 -1.103633
O  -5.538742 -1.357964 1.262686
O  -0.823344 -3.436425 -1.526013
O  -7.098663 2.422811 0.548763
O  -7.233323 -1.217926 -0.333125
N  -3.30838 0.442362 0.068628
N  0.886441 -1.980855 -0.848125
N  2.315346 0.010819 0.090268
N  3.082916 0.985228 0.567909
N  5.122493 -0.339369 0.073556
C  -4.047768 1.500768 0.786844
C  -4.12383 -0.557107 -0.655649
C  -1.918363 0.36649 0.09149
C  -4.438111 2.724011 -0.066093
C  -4.583201 -1.762926 0.186265
C  -1.250877 -0.797583 -0.404889
C  -1.122491 1.457938 0.60669
C  0.150779 -0.872719 -0.390538
C  0.944111 0.221886 0.13154
C  0.266646 1.377839 0.623104
C  0.411941 -3.176553 -1.382872
C  -6.781053 2.253812 -0.653117
C  -6.861874 -1.113805 0.861079
C  1.496502 -4.165439 -1.793656
C  4.445277 0.716836 0.509069
C  6.926719 1.080861 0.794538
C  6.501468 -0.170477 0.217397
C  -7.704136 1.858259 -1.777782
C  -7.71674 -0.680701 2.02667
C  8.288992 1.378081 0.995874
C  7.478816 -1.127227 -0.158205
C  9.224655 0.398343 0.608782
C  8.842044 -0.843262 0.037346
H  -4.959845 1.058178 1.21778
H  -3.448324 1.852395 1.644071
H  -5.007611 -0.048064 -1.070631
H  -3.553198 -0.939128 -1.519461
H  -3.588946 3.113416 -0.648626
H  -4.855725 3.508788 0.590922
H  -3.752369 -2.232737 0.733362
H  -5.079484 -2.498428 -0.47194
H  -1.790351 -1.665602 -0.781803
H  -1.600622 2.37364 0.96357
H  0.876091 2.2040 1.001708
H  1.904244 -1.826465 -0.744354
H  1.327868 -5.122161 -1.270204
H  1.408263 -4.366556 -2.875642
H  2.518424 -3.811804 -1.577871
H  -7.268633 2.099682 -2.758371
H  -8.676661 2.360313 -1.652599
H  -7.877281 0.766684 -1.718828
H  -7.257278 -0.958522 2.986368
H  -8.719373 -1.128419 1.935817
H  -7.83493 0.418874 1.986092
H  8.615213 2.32469 1.433161
H  7.15738 -2.07623 -0.596227
H  9.605327 -1.572041 -0.247774
