program: Gaussian 09
title: 000175269
version: EM64L-G09RevD.01
frameworkgroup: C1[X(C16H12Cl2N2O2)]
method: RPBEPBE
basis: SDD
operation: Freq
keyword: #p
keyword: freq=noraman
keyword: PBEPBE/SDD
title: #p freq=noraman PBEPBE/SDD
converged: YES YES NO NO
title: Mulliken charges:
elementType: Cl Cl O O N N C C C C C C C C C C C C C C C C H H H H H H H H H H H H
charge: 0.022672 0.022786 -0.323017 -0.323509 -0.395614 -0.395534 0.114036 0.114041 0.284351 0.285087 0.418502 0.418657 -0.143738 -0.143133 -0.351166 -0.351378 -0.387004 -0.387100 -0.229565 -0.229455 -0.628773 -0.629073 0.293259 0.293246 0.373277 0.373369 0.236070 0.236028 0.228104 0.241390 0.246829 0.246743 0.241473 0.228137
chargesum: 0.00000
title: Mulliken charges with hydrogens summed into heavy atoms:
elementType: Cl Cl O O N N C C C C C C C C C C C C C C C C
charge: 0.022672 0.022786 -0.323017 -0.323509 -0.022336 -0.022166 0.114036 0.114041 0.284351 0.285087 0.418502 0.418657 -0.143738 -0.143133 -0.351166 -0.351378 -0.093745 -0.093854 0.006505 0.006573 0.087551 0.087281
polarizability: 4.16547771e+02 8.81296339e-03 2.86083602e+02 -4.05117497e+00 -9.30100622e-03 9.03425968e+01
1716.lowfreq: -6.5922 -0.0017 0.0005 0.0007 0.8801 4.0104 28.4947 50.7593 51.5816
frequency: 28.4906 50.7591 51.5696 58.5682 121.5081 135.1664 164.8616 167.4781 183.5100 198.7310 218.0148 220.7992 240.7670 243.8754 265.8740 276.6313 281.8760 314.9376 344.0831 344.1314 349.7002 393.9311 422.7950 432.4765 452.9496 454.5109 465.6111 513.7475 524.5795 538.1375 600.2660 642.0168 674.4053 690.6498 694.4963 727.9423 737.0513 753.7400 789.5180 802.4033 843.5151 861.0448 890.6883 924.9046 950.3156 955.4532 969.6984 996.8032 998.0327 1012.5361 1035.3325 1087.9721 1103.9425 1104.4724 1119.7521 1127.7316 1153.5977 1155.1161 1169.1676 1189.1021 1247.3764 1251.4970 1307.3682 1331.6680 1348.2044 1359.0786 1373.7045 1408.1389 1430.2535 1432.7860 1454.1409 1456.4001 1469.2535 1470.3769 1471.0764 1473.0174 1484.1021 1487.7519 1525.7326 1566.3408 1602.5388 1608.6035 1645.3914 1649.6317 2892.7352 2903.9696 2986.6911 2987.6685 3073.0278 3074.3450 3090.1207 3090.6241 3134.4281 3152.5312 3168.2196 3174.8945
redmass: 5.8782 4.0112 10.8643 4.2330 4.1879 7.2659 5.8531 5.4615 4.5275 5.3405 1.1161 1.1254 6.6230 5.8640 6.3176 5.1100 10.6464 8.2387 4.9251 4.9501 8.7442 7.8327 8.5479 3.6170 7.8380 6.7765 10.4824 6.8950 7.2150 6.9781 7.2459 7.8936 5.5020 8.1027 6.3776 2.9535 7.4787 8.1821 6.9562 1.7321 3.4188 7.3805 5.9891 1.6831 1.5403 1.1467 2.4114 1.3839 6.1515 1.3534 2.0525 2.7440 1.3182 1.2878 3.6737 2.3161 2.1265 1.5231 1.1212 2.8131 3.6505 1.8506 3.3537 5.0883 3.6521 7.5061 10.5328 8.4422 2.1968 1.3693 2.6207 1.8149 3.0736 1.2211 1.1472 2.0453 1.3266 1.1198 4.1764 5.8366 9.0384 6.3601 1.3842 1.5165 1.0892 1.0875 1.0335 1.0334 1.1007 1.1009 1.1014 1.1013 1.0864 1.0912 1.0942 1.0989
irintensity: 0.2283 8.8556 0.1821 0.4074 0.9483 0.6498 0.1375 2.5506 2.8410 0.2230 0.6976 0.1122 0.3654 0.0710 1.9758 0.3257 3.6136 4.9349 7.3687 3.1695 4.6480 3.6399 3.2783 5.8161 0.7584 0.0802 14.7810 34.7554 2.2512 1.9769 6.2306 2.4106 0.0578 3.0621 2.8426 40.0640 0.3570 0.4086 43.0067 44.3592 0.1091 9.1081 37.0003 0.5786 5.1210 175.2664 10.7825 7.4007 121.0056 0.0031 0.4007 20.2338 3.2121 2.3005 6.8342 42.3821 5.9164 1.8009 13.6318 2.7367 55.2565 2.0863 61.4518 764.0687 1.9893 2.0799 6.0873 6.1372 9.7197 124.1150 2.1357 21.0621 7.7626 22.4446 8.0168 9.4892 2.9687 0.1370 544.9973 5.4541 3.5592 4.1419 77.5786 93.2679 42.8508 13.7335 102.0954 72.8490 22.4528 25.8968 20.1809 15.6265 4.9310 18.5930 1.4966 31.1951
temp: 298.150 k
press: 1.00000 atm
elementType: 17 17 8 8 7 7 6 6 6 6 6 6 6 6 6 6 6 6 6 6 6 6 1 1 1 1 1 1 1 1 1 1 1 1
symmnumber: 1
zpe: 644819.7 jmol-1
zpe.correction: 0.245599 hartree
zpe.thermalcorrener: 0.264692 hartree
zpe.thermalcorrenthalpy: 0.265637 hartree
zpe.thermalcorrgfe: 0.197859 hartree
zpe.sumelectzpe: -1795.456366 hartree
zpe.sumelectthermal: -1795.437273 hartree
zpe.sumelectthermalent: -1795.436329 hartree
zpe.sumelectthermalfe: -1795.504106 hartree
dipole: -0.8982 0.0030 1.0940
dipole: 1.4155
quadrupole: -128.0760 -129.6271 -143.5365
quadrupole: 0.0033 -3.3118 0.0042
quadrupole: 5.6705 4.1195 -9.7900 0.0033 -3.3118 0.0042
hfenergy: -1795.7019652 hartree
pointgroup: C01 [X(C16H12Cl2N2O2)]
dipole: 0.3332273 0.0164349 0.4459012 debye
polarizability: 415.2152292|6.2779286|286.3863513|18.7326386|0.2135765|91.3723891 unknown
InChI: InChI=1S/C16H12Cl2N2O2/c1-19-13-9-10(14(20-2)12(18)11(13)17)16(22)8-6-4-3-5-7(8)15(9)21/h3-6,19-20H,1-2H3
charge 0 multiplicity 1
34 atoms
Cl 4.276722 -1.345677 -0.076343
Cl 4.126624 1.754302 -0.089931
O  -1.033121 -2.816444 0.059861
O  -1.297784 2.710174 0.041162
N  1.478897 -2.765636 0.332731
N  1.206778 2.901641 0.313338
C  0.19071 -0.712511 0.096143
C  0.121183 0.732932 0.091447
C  -2.342017 -0.821838 -0.092839
C  -2.410236 0.598328 -0.097174
C  1.467428 -1.399154 0.21548
C  1.326213 1.53952 0.20567
C  -1.040733 -1.511395 0.022715
C  -1.180869 1.409606 0.01299
C  2.651492 -0.567242 0.153667
C  2.584396 0.824552 0.148442
C  -3.534964 -1.58515 -0.197836
C  -3.670935 1.242961 -0.206221
C  -4.779238 -0.939724 -0.305881
C  -4.847445 0.480314 -0.310037
C  2.541495 -3.686734 0.75433
C  2.176506 3.922973 0.726865
H  -3.450356 -2.675617 -0.190832
H  -3.691336 2.336537 -0.206065
H  0.499482 -3.152171 0.238749
H  0.19445 3.191788 0.216235
H  -5.697876 -1.530706 -0.387256
H  -5.818475 0.980092 -0.394567
H  2.048965 -4.622072 1.071037
H  3.119964 -3.294129 1.608087
H  3.249494 -3.926018 -0.05841
H  2.854537 4.227094 -0.090064
H  2.794397 3.59209 1.579062
H  1.597151 4.807514 1.042946
