program: Gaussian 09
title: 000175232
version: EM64L-G09RevD.01
frameworkgroup: C1[X(C13H18O6)]
method: RPBEPBE
basis: SDD
operation: Freq
keyword: #pfreq=noraman
keyword: PBEPBE/SDD
title: #p freq=noraman PBEPBE/SDD
converged: YES YES NO NO
title: Mulliken charges:
elementType: O O O O O O C C C C C C C C C C C C C H H H H H H H H H H H H H H H H H H
charge: -0.257308 -0.114739 -0.111246 -0.239799 -0.239633 -0.246550 -0.170736 0.128632 -0.342119 0.022262 0.080610 -0.758922 -0.767615 0.247053 0.260062 -0.227503 -0.226821 -0.676672 -0.668753 0.295556 0.291470 0.245406 0.228147 0.224099 0.241617 0.233884 0.243304 0.230689 0.252213 0.226310 0.236402 0.214722 0.232868 0.228029 0.211016 0.244473 0.229593
chargesum: 0.00000
title: Mulliken charges with hydrogens summed into heavy atoms:
elementType: O O O O O O C C C C C C C C C C C C C
charge: -0.257308 -0.114739 -0.111246 -0.239799 -0.239633 -0.246550 0.124820 0.128632 -0.050649 0.022262 0.080610 -0.061270 -0.048811 0.247053 0.260062 0.255399 0.235890 -0.001053 0.016329
polarizability: 1.75123913e+02 -9.93643679e-01 1.67107449e+02 6.46922593e+00 6.44896079e+00 1.30857981e+02
1716.lowfreq: -0.9585 -0.0004 -0.0004 0.0004 6.9975 11.3606 23.7935 30.7912 43.7191
frequency: 23.0802 30.7584 43.6543 46.1084 68.3639 76.1427 89.9807 109.2375 116.3533 120.5559 158.3969 170.1117 188.7784 200.3554 203.3272 238.1957 245.4319 251.0341 263.3914 273.9215 299.9367 314.5800 324.4486 343.4006 362.0728 383.9170 386.8328 432.9532 523.6366 545.0152 583.0546 615.3217 653.4979 693.3340 711.7476 719.1213 788.2772 799.9346 802.1759 805.2053 829.0231 849.7290 881.4915 897.0336 951.1264 971.3906 1000.2006 1019.0141 1022.1173 1062.3480 1065.7255 1100.9465 1107.1324 1112.6432 1115.6273 1135.1285 1135.8590 1140.1913 1158.5156 1185.0817 1210.5489 1221.0928 1247.5642 1250.3094 1252.7021 1301.4677 1325.0501 1355.8124 1359.9675 1391.8290 1398.6113 1401.4578 1402.1873 1461.5156 1462.7694 1464.4671 1470.7758 1472.5842 1474.2684 1479.2633 1484.3942 1485.3559 1493.0189 1576.2221 1615.0344 1655.8645 1678.7026 2978.1207 2996.0531 2999.0834 3005.0362 3012.9678 3020.1690 3023.1420 3040.4807 3069.6850 3074.5963 3080.9870 3091.5763 3092.1166 3095.8080 3100.5223 3110.6924 3113.4091 3113.6375
redmass: 3.7490 3.4093 4.2365 3.7330 3.5484 3.3186 3.5584 3.6026 6.0205 3.4336 3.5312 3.5855 2.4928 1.2514 2.7363 1.3449 1.4071 1.8699 3.0013 2.9561 4.4720 2.1683 6.2519 4.3051 5.6964 4.0732 4.4885 5.5282 6.3378 4.3188 6.8839 4.8619 5.0236 5.9591 6.2652 5.4292 4.4939 1.1974 1.1142 2.9076 4.9950 2.8448 3.0640 3.5516 3.7988 2.7127 1.8729 2.2155 2.2077 3.4240 1.7892 2.5453 2.2053 2.2640 2.2710 1.4958 1.7753 2.1125 3.8488 1.6378 3.5801 4.5205 1.5025 1.1743 1.1334 1.5951 1.4013 1.3776 1.3707 1.1982 1.2036 1.2550 1.2586 1.0392 1.0409 1.0481 1.0524 1.0665 1.0629 1.0486 1.0706 1.0663 1.0492 10.9473 10.0076 12.7991 12.6907 1.0377 1.0359 1.0360 1.0353 1.0581 1.0583 1.0826 1.0869 1.0977 1.1070 1.1057 1.0987 1.0982 1.0985 1.0988 1.1040 1.1012 1.1027
irintensity: 1.3972 0.2055 0.6899 0.1273 3.1643 1.6426 1.5728 1.3171 0.1942 0.8570 1.2015 0.5723 4.9358 0.3828 7.7630 0.1115 1.1059 1.3417 1.1447 18.9417 13.5060 2.2689 7.1314 8.4709 4.3281 2.2651 9.4678 7.2055 2.2014 3.2326 2.5100 3.2928 2.2356 2.5944 9.7033 3.0277 3.3072 7.1117 3.5288 9.1647 0.7242 21.5437 3.6491 6.0413 80.7599 9.7998 36.5832 35.6716 72.2030 51.6854 53.3843 201.5932 13.2961 2.4987 1.4884 12.8320 20.8020 48.5043 324.5395 12.2930 93.8235 147.5602 110.5497 11.4834 0.8200 15.2682 3.8986 5.3185 1.1794 9.4512 22.0110 26.6611 24.0301 12.4649 16.9353 9.8326 8.4302 4.1022 2.9989 19.9539 18.0207 12.7147 1.8233 203.7953 254.4515 174.8063 18.6962 19.6302 20.5741 18.5648 15.1602 17.0279 13.3654 1.8949 0.9664 24.8601 7.2261 0.6634 24.2233 27.8960 25.9760 15.0145 38.4292 10.8361 35.4867
temp: 298.150 k
press: 1.00000 atm
elementType: 8 8 8 8 8 8 6 6 6 6 6 6 6 6 6 6 6 6 6 1 1 1 1 1 1 1 1 1 1 1 1 1 1 1 1 1 1
symmnumber: 1
zpe: 766548.4 jmol-1
zpe.correction: 0.291963 hartree
zpe.thermalcorrener: 0.313295 hartree
zpe.thermalcorrenthalpy: 0.314239 hartree
zpe.thermalcorrgfe: 0.240363 hartree
zpe.sumelectzpe: -956.049816 hartree
zpe.sumelectthermal: -956.028483 hartree
zpe.sumelectthermalent: -956.027539 hartree
zpe.sumelectthermalfe: -956.101415 hartree
dipole: 0.4137 3.6737 4.4639
dipole: 5.7960
quadrupole: -98.9128 -111.8009 -116.8324
quadrupole: -3.8304 -0.7243 -13.7368
quadrupole: 10.2692 -2.6188 -7.6504 -3.8304 -0.7243 -13.7368
hfenergy: -956.3417785 hartree
pointgroup: C01 [X(C13H18O6)]
dipole: 0.8922134 1.6336488 -1.3172072 debye
polarizability: 171.8960535|-3.420231|170.5746615|8.7860932|-1.2184129|130.6186279 unknown
InChI: InChI=1S/C13H18O6/c1-5-18-11(16)8-7(3)13(4,10(15)9(8)14)12(17)19-6-2/h7-8H,5-6H2,1-4H3
charge 0 multiplicity 1
37 atoms
O  -0.935684 2.485923 0.133749
O  -2.407507 -1.789161 0.578053
O  0.408307 -2.794298 0.33061
O  2.884429 -0.993636 -0.41626
O  -0.257032 0.729589 1.504705
O  1.953967 1.136171 -0.579847
C  -0.474838 0.090176 -1.785491
C  -1.494431 0.237895 -0.575291
C  0.646993 -0.859449 -1.256523
C  -1.462682 -1.175018 0.047389
C  -0.041976 -1.761136 -0.194569
C  -1.133241 -0.488616 -3.055847
C  -2.910383 0.716014 -0.938827
C  -0.838757 1.154391 0.473051
C  1.869888 -0.107922 -0.717188
C  -0.162892 3.443142 0.996612
C  4.113532 -0.414555 0.223099
C  -0.4176 4.838425 0.43985
C  5.004027 -1.593896 0.59512
H  -0.047941 1.083426 -2.009281
H  1.027062 -1.539561 -2.042151
H  -1.918932 0.181329 -3.443528
H  -0.373633 -0.607414 -3.850089
H  -1.589703 -1.481338 -2.877294
H  -2.873705 1.712389 -1.408915
H  -3.400942 0.00608 -1.625037
H  -3.534825 0.778906 -0.031225
H  -0.513111 3.326498 2.037536
H  0.897898 3.142808 0.939788
H  4.586921 0.269167 -0.504708
H  3.793225 0.17364 1.101409
H  0.135449 5.583144 1.040918
H  -0.074439 4.914445 -0.605877
H  -1.490913 5.092075 0.477139
H  5.923609 -1.225905 1.085645
H  4.482448 -2.271144 1.291797
H  5.293415 -2.170386 -0.29982
