program: Gaussian 09
title: 000174983
version: EM64L-G09RevD.01
frameworkgroup: C1[X(C16H18O2)]
method: RPBEPBE
basis: SDD
operation: Freq
keyword: #pfreq=noraman
keyword: PBEPBE/SDD
title: #p freq=noraman PBEPBE/SDD
converged: YES YES NO NO
title: Mulliken charges:
elementType: O O C C C C C C C C C C C C C C C C H H H H H H H H H H H H H H H H H H
charge: -0.421227 -0.212852 -0.601908 -0.027766 0.363926 0.196328 0.222174 0.354248 -0.690825 -0.710231 -0.418371 -0.394447 -0.428895 -0.290243 -0.428490 -0.671781 -0.283433 0.208276 0.217571 0.210594 0.199602 0.234078 0.200444 0.209124 0.213272 0.234524 0.203043 0.236767 0.231980 0.271664 0.225301 0.235944 0.255255 0.252171 0.227160 0.377023
chargesum: 0.00000
title: Mulliken charges with hydrogens summed into heavy atoms:
elementType: O O C C C C C C C C C C C C C C C C
charge: -0.044204 -0.212852 -0.173743 0.171837 0.363926 0.196328 0.222174 0.354248 -0.047178 -0.059392 -0.181604 -0.162467 -0.157231 -0.064943 -0.192546 -0.164355 -0.056273 0.208276
polarizability: 2.20616182e+02 -9.08219968e+00 2.03751991e+02 -2.07880486e+00 7.15493082e+00 1.14577122e+02
1716.lowfreq: -17.2254 -5.9899 -0.0005 -0.0004 0.0002 3.2245 20.8997 32.7791 38.2574
frequency: 20.7211 32.2791 38.2302 58.4300 85.7466 97.0262 137.3823 182.0267 213.8281 230.1471 241.2103 260.2036 270.1180 281.9703 367.7745 374.6358 393.1451 429.7521 464.9646 467.7981 473.9273 488.9084 505.5208 534.1038 548.9033 588.4110 624.4394 638.4645 682.6082 733.7692 747.5381 765.2959 784.2904 803.6453 822.9335 848.0793 862.3686 876.9543 890.9585 915.9785 919.5703 920.9109 940.8886 956.5189 961.4778 980.9881 984.6898 1039.5178 1062.6403 1077.9579 1088.8035 1115.3310 1138.6838 1178.5107 1183.0975 1186.7250 1192.8394 1226.0517 1240.9631 1250.2210 1257.3082 1268.7387 1275.0842 1320.9242 1327.4515 1347.2923 1376.3465 1380.8814 1393.5797 1395.2352 1420.4141 1427.2093 1460.2116 1464.2494 1465.2164 1474.1993 1477.2392 1487.6847 1492.0916 1523.1038 1591.8487 1599.5221 1624.9003 1670.8814 2955.0380 2970.2373 2976.4462 2988.8748 3024.3450 3040.6091 3062.4334 3068.6286 3072.1013 3079.4985 3090.7281 3122.6536 3127.7076 3142.1153 3146.5419 3163.9707 3170.3120 3506.3160
redmass: 8.8241 4.4561 3.1478 5.8068 3.6734 4.2187 4.5430 4.0936 2.0390 2.0193 1.5326 1.3135 3.2702 4.1099 2.1184 3.5297 2.2054 2.8309 2.9501 2.8918 3.4682 3.6146 6.1225 3.8532 3.5707 3.4778 3.8546 1.6217 2.9159 4.3628 1.3790 3.5905 5.1849 1.3278 3.7686 3.2957 3.9987 2.1907 2.1908 1.4277 1.3564 1.4695 2.0065 1.8963 1.6586 1.3582 1.3388 2.2330 2.0936 2.1111 1.6932 1.6816 2.6206 1.6049 1.2495 1.3008 1.5102 1.3492 1.6265 1.8266 1.6798 1.4202 1.8438 1.8443 1.5218 1.3493 1.3300 2.1675 3.2360 1.2666 2.6259 3.0049 2.1532 1.1009 1.0980 1.0564 1.0706 1.0658 1.1047 3.9920 7.4437 5.3786 6.3643 8.6194 1.0809 1.0358 1.0368 1.0631 1.0602 1.0993 1.0996 1.0989 1.0997 1.0992 1.1013 1.0867 1.0872 1.0917 1.0920 1.0975 1.0963 1.0639
irintensity: 1.5575 0.1942 0.1735 0.4891 0.1321 0.0816 0.7124 1.7712 0.1896 0.2440 0.1069 0.1301 1.2018 4.8946 0.4467 5.3681 0.2774 1.8244 4.0928 2.1344 2.6969 2.3227 0.6461 32.1508 13.7126 4.4954 4.5458 136.0001 33.6458 5.6095 1.3168 2.0391 0.8482 117.8215 4.3851 1.5472 7.6715 0.9524 9.8033 0.7551 0.6163 0.2332 8.4571 0.9863 0.4807 0.6395 1.9148 179.3436 4.3628 56.7898 11.6371 2.8073 3.9759 3.5777 3.7136 7.2861 6.6148 1.1724 3.5880 7.0074 2.6165 18.0097 2.5292 48.0119 2.3897 9.1514 16.4665 15.0143 2.9265 14.5262 23.8528 0.2959 2.7687 19.6380 4.7044 1.5358 8.8689 18.0419 20.1189 11.2741 4.1757 8.4413 1.2707 208.8631 31.1066 35.1668 26.8439 52.1466 15.6427 16.2490 23.3209 57.8908 35.8178 71.9809 4.3884 11.7685 7.2073 17.1270 20.4753 16.3973 23.0288 20.7320
temp: 298.150 k
press: 1.00000 atm
elementType: 8 8 6 6 6 6 6 6 6 6 6 6 6 6 6 6 6 6 1 1 1 1 1 1 1 1 1 1 1 1 1 1 1 1 1 1
symmnumber: 1
zpe: 781526.6 jmol-1
zpe.correction: 0.297668 hartree
zpe.thermalcorrener: 0.314629 hartree
zpe.thermalcorrenthalpy: 0.315574 hartree
zpe.thermalcorrgfe: 0.251434 hartree
zpe.sumelectzpe: -769.661140 hartree
zpe.sumelectthermal: -769.644178 hartree
zpe.sumelectthermalent: -769.643234 hartree
zpe.sumelectthermalfe: -769.707374 hartree
dipole: 0.8575 -0.7613 -0.9751
dipole: 1.5052
quadrupole: -96.5142 -97.4885 -114.0098
quadrupole: 4.3557 3.1166 -4.6459
quadrupole: 6.1566 5.1823 -11.3389 4.3557 3.1166 -4.6459
hfenergy: -769.9588079 hartree
pointgroup: C01 [X(C16H18O2)]
dipole: -0.3556674 0.3315609 -0.3380444 debye
polarizability: 220.9126844|-8.8433736|203.9139275|-2.6147978|2.6295755|114.1186827 unknown
InChI: InChI=1S/C16H18O2/c1-11(2)9-12-5-3-8-15-13(10-16(17)18)6-4-7-14(12)15/h3-8,11,17H,9-10H2,1-2H3
charge 0 multiplicity 1
36 atoms
O  4.001209 1.727185 0.764149
O  3.873027 -0.366949 1.760041
C  -3.22044 -0.125054 -0.618221
C  -3.914652 -0.283403 0.78168
C  -1.795914 0.422366 -0.605804
C  -0.62501 -0.433705 -0.621603
C  0.70477 0.161546 -0.605393
C  1.868461 -0.697953 -0.638492
C  -3.189636 -1.284856 1.710719
C  -4.116129 1.073247 1.497626
C  -1.60879 1.813411 -0.591001
C  -0.728361 -1.865629 -0.667556
C  0.828089 1.590207 -0.560752
C  -0.309487 2.397953 -0.559875
C  1.707901 -2.086005 -0.67772
C  3.28029 -0.113708 -0.637213
C  0.407757 -2.673002 -0.693629
C  3.730746 0.346242 0.74636
H  -3.849923 0.563522 -1.215555
H  -3.261693 -1.102134 -1.134243
H  -4.923133 -0.695591 0.561805
H  -2.160847 -0.94903 1.934179
H  -3.126273 -2.29207 1.259066
H  -3.731227 -1.380413 2.670403
H  -4.697812 0.93425 2.427979
H  -3.147391 1.529803 1.770497
H  -4.665153 1.79158 0.859229
H  -2.488004 2.467931 -0.608535
H  -1.715912 -2.334021 -0.681196
H  1.818661 2.053071 -0.524761
H  -0.208585 3.488777 -0.539732
H  2.592706 -2.732469 -0.693446
H  3.378465 0.728191 -1.341107
H  3.989201 -0.900938 -0.949766
H  0.307829 -3.763157 -0.728618
H  4.286661 1.993605 1.680686
