program: Gaussian 09
title: 000174927
version: EM64L-G09RevD.01
frameworkgroup: C1[X(C24H14Cl3N5O11S3)]
method: RPBEPBE
basis: SDD
operation: Freq
keyword: #p
keyword: freq=noraman
keyword: PBEPBE/SDD
title: #p freq=noraman PBEPBE/SDD
converged: YES YES NO NO
title: Mulliken charges:
elementType: Cl Cl Cl S S S O O O O O O O O O O O N N N N N C C C C C C C C C C C C C C C C C C C C C C C C H H H H H H H H H H H H H H
charge: 0.051214 0.057006 0.028936 0.981957 0.981481 0.985388 -0.323819 -0.283616 -0.552111 -0.557695 -0.483358 -0.502339 -0.550702 -0.480891 -0.491332 -0.464634 -0.513510 -0.491167 -0.658107 -0.475750 -0.044904 0.152451 0.057525 0.188163 0.346987 0.395028 -0.385514 -0.087005 0.651812 -0.388269 0.299217 -0.160506 0.283878 -0.421273 -0.454525 -0.455791 0.615895 -0.204908 -0.375938 -0.374336 -0.224968 -0.222108 0.439016 -0.259056 -0.147707 -0.321594 0.328159 0.390091 0.390884 0.331847 0.287724 0.298084 0.364572 0.394364 0.245962 0.245867 0.377302 0.390944 0.403462 0.392215
chargesum: 0.00000
title: Mulliken charges with hydrogens summed into heavy atoms:
elementType: Cl Cl Cl S S S O O O O O O O O O O O N N N N N C C C C C C C C C C C C C C C C C C C C C C C C
charge: 0.051214 0.057006 0.028936 0.981957 0.981481 0.985388 -0.323819 -0.283616 -0.161167 -0.154233 -0.483358 -0.502339 -0.158487 -0.480891 -0.491332 -0.464634 -0.513510 -0.101076 0.100829 -0.098448 -0.044904 0.152451 0.057525 0.188163 0.346987 0.395028 -0.385514 -0.087005 0.651812 -0.060110 0.299217 -0.160506 0.283878 -0.421273 -0.063642 -0.455791 0.615895 0.126939 -0.088215 -0.076252 0.020994 0.023759 0.439016 -0.259056 -0.147707 -0.321594
polarizability: 8.53761325e+02 -1.97354204e+01 5.81682650e+02 -7.54290640e+01 -1.29893300e+01 2.76361931e+02
1716.lowfreq: -2.6650 -0.0013 0.0012 0.0014 2.7685 3.9649 12.0842 16.9894 19.8621
frequency: 12.0784 16.9757 19.8598 26.6709 29.3504 37.4730 43.0847 49.9443 53.0852 53.8650 68.9512 74.3994 85.7167 92.3849 97.5707 102.5965 107.9306 114.1870 128.0619 131.5151 142.4111 146.9277 154.6530 159.4526 171.1049 180.6182 181.6996 188.6622 189.9707 195.2271 206.2533 209.2304 215.1295 228.5423 231.8733 243.2627 249.8969 264.9558 273.5150 281.2580 291.8896 303.3813 306.6229 316.9986 317.7027 324.4905 327.5064 328.6599 331.9137 350.8929 356.1688 366.2707 385.1444 393.5068 400.4430 400.9622 413.3335 423.7138 424.5630 434.2550 443.9217 449.1635 457.9281 465.3528 484.0111 487.4644 513.1843 518.0551 522.4266 534.2481 547.2455 552.5050 553.7217 584.4643 586.5491 610.6764 625.3052 644.2599 648.8260 654.2103 658.8311 675.3439 687.9981 699.5354 728.1538 732.9944 741.4523 752.8530 761.6570 775.9882 791.0647 794.3845 807.1715 811.1811 812.2655 823.2647 834.9461 865.5570 878.0486 880.2739 885.2050 892.0362 894.1242 921.2234 933.4823 937.7832 941.3482 949.9531 952.3233 957.4289 972.1004 985.8371 988.2815 998.7849 1007.8264 1017.1939 1017.5628 1030.8329 1048.1830 1051.3245 1062.1682 1086.9372 1091.6193 1136.0806 1172.8091 1179.1558 1197.0257 1214.4464 1233.3125 1239.6011 1252.4850 1266.6668 1275.2005 1299.4978 1313.5060 1316.9206 1348.1175 1356.4349 1384.7116 1389.0189 1400.7371 1408.7502 1426.1685 1433.6405 1449.1612 1450.3556 1463.3395 1469.9927 1482.3854 1499.8991 1516.2041 1532.2117 1535.4460 1571.0402 1582.6313 1599.2559 1604.2003 1606.9497 1633.2531 1639.4219 3002.1645 3128.5523 3140.1004 3142.7094 3155.3185 3158.4539 3161.3538 3170.8214 3178.6013 3247.5122 3434.7541 3465.8431 3473.0434 3474.3045
redmass: 11.1419 13.7452 11.7656 10.8326 9.4921 8.7925 13.0486 10.1990 14.3361 12.8150 8.8903 10.5878 9.4489 7.9001 8.1968 11.1579 12.9724 6.7123 9.0594 10.3890 13.9084 6.5349 9.4536 10.9052 9.0287 7.8307 2.3213 5.6991 4.7618 5.7472 10.2396 7.7585 6.1229 5.2029 4.8683 3.2756 4.4914 5.0078 5.8621 6.9488 5.3370 6.2552 5.3431 8.1847 9.0711 8.1048 19.0633 6.4099 3.4555 4.2447 3.2908 7.6972 7.9358 10.7016 12.7073 7.8851 9.6784 3.8648 8.0494 7.8676 7.5662 7.8173 11.1170 8.3818 6.9278 4.3582 5.2989 7.0718 8.0947 11.8233 13.7265 9.8420 13.3803 11.0540 7.0790 7.3154 5.3597 10.7438 8.4214 6.5390 7.7264 3.1964 8.6879 7.4952 2.2449 2.9907 1.9344 5.4519 7.7864 5.6022 4.0488 5.2007 3.6117 2.7583 5.6086 11.3600 12.2482 1.2624 4.3072 2.5661 5.2882 1.3365 1.3570 1.7127 1.4982 2.3012 5.9283 9.8246 8.5687 6.1696 6.7421 1.7889 4.5503 1.3902 6.1654 3.5920 1.3728 2.2891 1.1683 1.2091 2.1830 1.3421 2.3163 2.3733 1.2781 1.7377 3.9234 2.8792 4.2207 1.9176 1.9100 2.5726 2.4489 2.2166 3.4797 9.3665 3.4278 4.1550 5.7830 8.3117 7.0771 8.6569 5.5709 4.3724 4.3795 3.5275 5.0477 3.1565 4.0323 9.4422 7.0829 5.9590 8.0309 2.9327 2.0026 2.5936 3.9597 5.3955 1.6160 6.7119 1.0828 1.0922 1.0830 1.0868 1.0926 1.0908 1.0919 1.0946 1.0998 1.0561 1.0661 1.0979 1.0661 1.0676
irintensity: 0.5582 0.1115 0.1945 1.4286 0.0821 2.5728 0.2962 0.1738 0.7349 0.9645 7.9569 0.0674 1.0847 4.3349 5.3610 1.8551 2.4760 2.5624 5.2866 5.0878 1.5543 2.3217 2.1790 2.9005 6.1247 0.5987 27.1270 24.7687 22.1019 31.9620 2.5715 5.0475 1.1581 4.1927 21.3922 13.4814 33.1328 45.4522 1.6088 2.7761 26.3469 44.7799 27.3854 12.7234 9.1153 29.0463 0.9690 18.5144 43.2858 13.9903 88.9666 16.2024 17.9042 26.0257 19.6777 0.2463 105.5080 5.7283 24.0366 34.2225 52.5060 33.4512 4.3310 4.0850 8.9373 61.7257 16.6125 15.7621 19.1727 23.5498 179.0491 69.1814 182.7832 1.4834 14.9764 33.2078 7.1141 1.0361 86.7709 1.5448 48.7104 13.6745 17.5026 7.6944 57.1399 32.4623 7.3469 13.1692 7.3644 1.2596 36.1782 35.2965 23.0064 94.1451 20.9934 41.7458 91.7104 98.9797 40.6649 50.3330 14.1062 164.5139 94.1670 41.8437 4.6376 2.4380 8.2989 57.5093 67.3509 186.7091 20.4582 12.1107 6.5751 3.0958 42.8951 145.5510 0.4196 10.4107 70.2138 135.2214 14.1315 73.5645 9.9771 53.0359 21.1475 4.6538 127.9506 25.3643 253.5379 70.7880 15.2346 5.7302 17.6522 526.2006 674.0891 29.7357 100.7818 17.6856 45.3980 3.3451 3.9833 75.2265 7.0077 301.5478 74.9898 134.2661 380.4216 48.2838 80.7960 668.6833 143.2486 1114.9457 75.7992 119.3017 525.6435 283.5895 80.4578 8.4248 554.7259 63.2228 150.3379 20.9281 362.0618 2.9928 45.2085 11.5741 33.8479 0.8488 30.8030 80.6252 66.0770 222.2050 67.6400 42.2365
temp: 298.150 k
press: 1.00000 atm
elementType: 17 17 17 16 16 16 8 8 8 8 8 8 8 8 8 8 8 7 7 7 7 7 6 6 6 6 6 6 6 6 6 6 6 6 6 6 6 6 6 6 6 6 6 6 6 6 1 1 1 1 1 1 1 1 1 1 1 1 1 1
symmnumber: 1
zpe: 950387.5 jmol-1
zpe.correction: 0.361983 hartree
zpe.thermalcorrener: 0.405965 hartree
zpe.thermalcorrenthalpy: 0.406909 hartree
zpe.thermalcorrgfe: 0.282076 hartree
zpe.sumelectzpe: -4594.794121 hartree
zpe.sumelectthermal: -4594.750140 hartree
zpe.sumelectthermalent: -4594.749196 hartree
zpe.sumelectthermalfe: -4594.874029 hartree
dipole: 4.3002 -2.2731 0.0630
dipole: 4.8644
quadrupole: -266.7817 -360.6503 -302.2944
quadrupole: -1.2577 -26.8805 -10.2311
quadrupole: 43.1271 -50.7415 7.6144 -1.2577 -26.8805 -10.2311
hfenergy: -4595.1561043 hartree
pointgroup: C01 [X(C24H14Cl3N5O11S3)]
dipole: 1.8131003 0.6122698 -0.0224652 debye
polarizability: 849.117674|-17.5505791|577.4489855|87.9334895|-46.0668171|285.2392471 unknown
InChI: InChI=1S/C24H14Cl3N5O11S3/c25-18-22(26)31-24(27)32-23(18)30-11-5-10(13(44(35,36)37)7-14(11)45(38,39)40)29-12-6-15(46(41,42)43)19(28)17-16(12)20(33)8-3-1-2-4-9(8)21(17)34/h1-7,29-30,35,38,41H,28H2
charge 0 multiplicity 1
60 atoms
Cl -6.591604 1.972993 0.389499
Cl -5.90839 5.15579 0.814784
Cl -0.668253 4.031249 0.960339
S  0.689796 3.039735 -2.497196
S  -0.215454 -4.433575 -0.407139
S  -5.36928 -2.517671 -0.301878
O  2.734684 -2.480761 1.067551
O  5.641919 2.061385 -0.102255
O  1.337084 2.323466 -4.076663
O  0.582416 -4.356373 1.264108
O  -0.909408 2.827393 -2.438308
O  1.324576 4.524983 -2.318007
O  -5.424374 -2.288848 -2.138067
O  -1.161412 -5.734138 -0.497664
O  0.932686 -4.160131 -1.516007
O  -5.657605 -4.063379 0.048259
O  -6.273596 -1.337853 0.375177
N  0.592009 -1.457757 0.108422
N  3.606314 3.144703 -1.267592
N  -4.034897 0.292355 0.291032
N  -2.518792 2.123129 0.595737
N  -3.329253 4.383103 0.84567
C  2.741236 -0.259675 0.103928
C  3.51384 0.908046 -0.237262
C  1.348159 -0.340497 -0.250152
C  2.920702 2.004975 -0.978372
C  1.554854 1.802904 -1.382835
C  3.389092 -1.394192 0.806378
C  -0.789195 -1.638577 0.023893
C  0.792112 0.699629 -1.053213
C  4.805937 -1.285619 1.204313
C  4.930345 1.015997 0.162697
C  5.552965 -0.113767 0.897803
C  -1.329203 -2.946025 -0.158648
C  -1.706846 -0.568816 0.187445
C  -3.574548 -2.097222 -0.094185
C  -3.110934 -0.755352 0.121278
C  -2.700485 -3.184812 -0.220013
C  5.426162 -2.357004 1.898479
C  6.911894 -0.024459 1.288954
C  6.775612 -2.260265 2.284653
C  7.520148 -1.090581 1.979238
C  -3.79762 1.646328 0.470876
C  -4.901638 2.5669 0.539434
C  -4.596932 3.927388 0.725324
C  -2.366714 3.447039 0.77336
H  -0.228192 0.627779 -1.439774
H  1.194759 -2.215293 0.521672
H  -1.355942 0.436139 0.425827
H  -3.080861 -4.203477 -0.368248
H  4.831906 -3.247094 2.123477
H  7.462903 0.886571 1.038217
H  3.131804 3.930737 -1.728045
H  4.592064 3.16909 -0.950362
H  7.252149 -3.08702 2.82127
H  8.570265 -1.018055 2.280815
H  -5.036708 -0.002574 0.313333
H  0.971392 2.864039 -4.83725
H  1.578556 -4.375464 1.135456
H  -6.329707 -2.572018 -2.461864
