program: Gaussian 09
title: 000174867
version: EM64L-G09RevD.01
frameworkgroup: C1[X(C17H22O5)]
method: RPBEPBE
basis: SDD
operation: Freq
keyword: #pfreq=noraman
keyword: PBEPBE/SDD
title: #p freq=noraman PBEPBE/SDD
converged: YES YES NO NO
title: Mulliken charges:
elementType: O O O O O C C C C C C C C C C C C C C C C C H H H H H H H H H H H H H H H H H H H H H H
charge: -0.252359 -0.477495 -0.302818 -0.202797 -0.229344 -0.148532 -0.320001 0.302063 -0.147075 -0.191452 -0.573397 -0.092638 -0.515677 0.453597 -0.421961 0.262185 -0.776632 0.081342 -0.837705 -0.668420 0.289424 -0.759108 0.260484 0.266002 0.257870 0.313348 0.230653 0.257101 0.275183 0.230318 0.211282 0.241742 0.212398 0.236993 0.226268 0.350845 0.275091 0.221757 0.217546 0.230443 0.257129 0.248244 0.253335 0.254768
chargesum: 0.00000
title: Mulliken charges with hydrogens summed into heavy atoms:
elementType: O O O O O C C C C C C C C C C C C C C C C C
charge: -0.252359 -0.126651 -0.302818 -0.202797 -0.229344 0.111952 -0.054000 0.302063 0.110796 0.121896 -0.085642 0.182545 -0.074077 0.453597 -0.180219 0.262185 -0.100973 0.081342 -0.123311 -0.180848 0.289424 -0.002761
polarizability: 2.26911788e+02 7.15177308e+00 2.12661782e+02 3.30908964e+00 9.81774401e+00 1.38801541e+02
1716.lowfreq: -14.4821 -4.5426 0.0006 0.0006 0.0009 6.4651 32.9646 39.8137 43.5056
frequency: 32.7900 39.6848 43.5015 49.4874 64.3003 81.3775 101.7749 123.9576 148.2028 157.8438 173.3226 184.8042 203.1339 210.6572 238.3654 250.6456 265.8410 281.9640 290.9860 296.1933 317.4016 330.2831 341.7736 366.8727 391.9518 414.2838 422.7061 456.4523 475.2234 511.2232 517.9610 545.1533 568.6188 590.5357 606.8956 613.6923 637.8922 658.3495 671.8841 712.0041 753.0122 773.7963 784.2794 803.6943 808.8843 847.9344 869.6822 886.9616 889.1304 918.0071 941.3465 956.4412 968.1829 977.3822 981.8165 988.6848 993.3537 1010.3216 1029.4209 1029.9480 1039.9574 1042.1296 1051.2404 1068.1092 1085.8993 1101.6958 1119.9455 1137.4136 1149.6909 1175.5558 1181.3038 1183.9012 1208.8478 1221.3499 1236.2483 1244.1804 1256.2217 1271.6900 1281.0063 1300.7908 1309.6554 1313.9310 1315.2820 1332.9182 1343.1095 1359.8205 1362.5912 1374.7500 1385.1431 1386.7375 1400.2838 1417.0858 1452.7109 1454.0789 1455.4028 1455.8387 1468.4448 1471.7372 1475.0879 1477.9799 1655.2000 1671.0253 1672.7536 1687.3028 2940.8674 2972.6839 2978.0583 2987.0337 2993.6827 2997.4998 3000.8313 3004.4948 3015.4379 3029.1462 3040.3551 3047.2031 3054.7495 3071.8741 3089.3478 3090.9015 3095.5682 3103.3772 3142.3582 3148.7348 3214.4747 3519.0525
redmass: 5.5595 3.8096 1.2514 4.8283 2.8189 3.3773 5.5486 4.4188 2.0669 1.8640 3.8052 5.1234 3.0629 4.3601 2.6950 1.7257 1.9205 3.1269 3.6651 3.0303 3.3736 4.0932 2.6349 1.9236 1.7540 3.5322 3.6541 3.1605 3.0518 3.7548 2.7516 3.6905 3.3378 3.2583 6.0174 2.7984 4.1472 3.1287 3.5735 3.6417 4.1549 3.3701 2.3021 2.8479 1.4117 3.2973 3.7000 2.8135 4.4621 3.5688 2.3516 1.9338 1.9147 1.5590 1.8281 2.1509 1.9540 1.9440 2.4351 1.6126 2.1468 2.6468 2.3038 2.5692 2.9805 2.0321 1.7296 1.8758 1.9847 2.2787 1.9394 2.4710 1.2903 1.2877 1.6098 1.7051 2.1388 1.4635 1.3143 1.7142 1.4389 1.4634 1.4543 1.2751 1.5641 1.6726 1.4697 1.4533 1.2536 1.2487 1.2487 1.1808 1.0581 1.0821 1.0463 1.0510 1.0646 1.0700 1.0875 1.0617 9.6982 6.5611 6.9586 11.5658 1.0684 1.0393 1.0357 1.0812 1.0815 1.0660 1.0817 1.0388 1.0861 1.0923 1.0891 1.0963 1.0928 1.0991 1.1000 1.0998 1.0946 1.0618 1.1016 1.0958 1.1151 1.0660
irintensity: 0.2408 2.8366 0.5157 3.5939 0.1687 3.2359 1.8325 2.4447 0.2180 1.0455 3.2884 5.9005 3.4364 1.8356 5.8799 5.3546 0.6014 3.7292 6.4203 4.9376 4.0946 6.7073 39.9619 39.1823 76.2707 9.2562 1.6329 11.6342 15.2824 16.0184 1.1945 1.5798 7.2747 4.9739 5.2863 2.7205 2.6311 6.7884 4.7852 6.3885 7.9295 3.4182 9.3609 4.4886 24.1938 26.1840 25.4941 26.3632 41.4442 87.6476 21.5020 18.8775 40.3688 34.0476 23.8123 87.4412 21.2681 26.0593 20.7578 64.0814 38.7829 101.7147 14.0829 11.3512 37.4859 28.7807 9.0420 3.3320 29.5986 4.1214 65.6159 275.3504 15.3812 8.9720 45.7301 26.3359 45.8063 13.5741 0.5821 7.0321 27.0686 4.0031 11.5940 4.5085 15.7943 23.2260 6.6659 5.4142 17.7370 56.8606 21.3600 20.6642 27.6695 2.7471 9.6194 20.1532 14.8697 8.4702 4.6382 18.5777 176.4639 3.6934 38.9390 273.0161 43.2321 34.0038 18.2381 4.5148 5.8733 7.8249 11.1066 1.4590 45.4387 36.7926 1.7105 20.0930 21.1419 37.1667 16.5662 25.5465 6.3016 3.7896 7.5237 23.4899 3.5073 29.7089
temp: 298.150 k
press: 1.00000 atm
elementType: 8 8 8 8 8 6 6 6 6 6 6 6 6 6 6 6 6 6 6 6 6 6 1 1 1 1 1 1 1 1 1 1 1 1 1 1 1 1 1 1 1 1 1 1
symmnumber: 1
zpe: 940241.2 jmol-1
zpe.correction: 0.358119 hartree
zpe.thermalcorrener: 0.380010 hartree
zpe.thermalcorrenthalpy: 0.380954 hartree
zpe.thermalcorrgfe: 0.307323 hartree
zpe.sumelectzpe: -1035.440546 hartree
zpe.sumelectthermal: -1035.418655 hartree
zpe.sumelectthermalent: -1035.417711 hartree
zpe.sumelectthermalfe: -1035.491342 hartree
dipole: 3.1120 -4.6895 0.3356
dipole: 5.6382
quadrupole: -122.2552 -145.6326 -135.9228
quadrupole: 10.0211 10.7775 2.8346
quadrupole: 12.3483 -11.0291 -1.3193 10.0211 10.7775 2.8346
hfenergy: -1035.798665 hartree
pointgroup: C01 [X(C17H22O5)]
dipole: -1.5238944 -1.6058531 -0.1396895 debye
polarizability: 223.9706899|-8.9736759|215.3307831|2.9261014|-11.112204|139.0736381 unknown
InChI: InChI=1S/C17H22O5/c1-8-5-6-11-13(8)15-14(9(2)16(19)22-15)12(21-10(3)18)7-17(11,4)20/h5,11-15,20H,2,6-7H2,1,3-4H3
charge 0 multiplicity 1
44 atoms
O  2.047897 1.655054 0.113769
O  -0.8970 -1.668278 -1.648674
O  -2.579529 0.29247 -0.409621
O  1.753171 3.960006 -0.047967
O  -3.987192 0.379076 1.455269
C  1.064528 -2.112996 -0.341107
C  1.809518 -0.733182 -0.503695
C  -0.487241 -2.15779 -0.300693
C  1.174997 0.439698 0.274983
C  -0.228641 0.889852 -0.239206
C  -1.135271 -1.298444 0.829127
C  -1.374762 0.188708 0.505488
C  1.790236 -2.818782 0.849059
C  3.21665 -1.072467 0.026296
C  3.17571 -2.197268 0.793198
C  -0.183638 2.401768 -0.118908
C  -0.963084 -3.62237 -0.156785
C  1.254208 2.82159 -0.020722
C  4.429457 -0.233884 -0.284498
C  -1.190325 3.309331 -0.102288
C  -3.842197 0.375405 0.214315
C  -4.939779 0.441056 -0.823771
H  1.336016 -2.680218 -1.253747
H  1.828985 -0.431346 -1.568792
H  1.163936 0.227196 1.361962
H  -0.296107 0.598364 -1.305187
H  -0.507033 -1.36477 1.737702
H  -2.111925 -1.731296 1.117242
H  -1.638252 0.723643 1.436077
H  1.811975 -3.917069 0.723411
H  1.298276 -2.626498 1.82784
H  4.039208 -2.624079 1.314616
H  -2.059088 -3.681444 -0.290947
H  -0.489205 -4.254355 -0.927719
H  -0.718541 -4.034943 0.839055
H  -1.82425 -1.315714 -1.600463
H  4.291377 0.807957 0.053232
H  4.60368 -0.186734 -1.377762
H  5.336115 -0.649801 0.188509
H  -2.242099 3.018076 -0.182508
H  -0.95565 4.376114 -0.00971
H  -5.124218 -0.567758 -1.236997
H  -4.64995 1.095021 -1.662039
H  -5.867963 0.802802 -0.357942
