program: Gaussian 09
title: 000174643
version: EM64L-G09RevD.01
frameworkgroup: C1[X(C18H19N5O3)]
method: RPBEPBE
basis: SDD
operation: Freq
keyword: #p
keyword: freq=noraman
keyword: PBEPBE/SDD
title: #p freq=noraman PBEPBE/SDD
converged: YES YES NO NO
title: Mulliken charges:
elementType: O O O N N N N N C C C C C C C C C C C C C C C C C C H H H H H H H H H H H H H H H H H H H
charge: -0.321961 -0.186412 -0.202020 -0.438752 -0.089811 0.053889 -0.414555 -0.456705 -0.489183 0.441838 -0.098924 0.062289 0.068851 0.316114 -0.563471 0.259961 -0.349226 -0.369811 -0.250416 -0.226064 -0.234008 0.192657 0.268372 -0.789382 -0.212597 -0.675942 0.235165 0.235910 0.306962 0.229069 0.233568 0.254466 0.337729 0.332101 0.227629 0.229875 0.232932 0.214491 0.258343 0.251457 0.235310 0.224230 0.211618 0.224211 0.230200
chargesum: 0.00000
title: Mulliken charges with hydrogens summed into heavy atoms:
elementType: O O O N N N N N C C C C C C C C C C C C C C C C C C
charge: -0.321961 -0.186412 -0.202020 -0.131789 -0.089811 0.053889 -0.076827 -0.124603 -0.018107 0.441838 -0.098924 0.062289 0.068851 0.316114 -0.334403 0.259961 -0.115658 -0.115344 -0.022787 0.003811 -0.001076 0.192657 0.268372 -0.065091 0.246943 -0.009913
polarizability: 5.34813081e+02 1.53642696e+01 2.72481418e+02 -5.35416747e+00 8.69607084e+00 1.17090851e+02
1716.lowfreq: -10.4922 -0.0010 -0.0005 0.0008 0.2448 2.9859 6.8129 17.1620 22.5954
frequency: -8.0276 17.0559 22.5621 35.7104 45.7721 47.4272 51.7752 63.4270 66.6989 77.4960 95.2680 114.0440 122.4362 149.4363 167.4144 191.2281 208.8168 217.9513 231.3755 249.9887 262.5099 305.0571 326.4217 333.5447 363.4273 372.2244 402.3603 415.5376 455.5581 485.6377 501.1618 512.7140 535.6296 568.9325 573.8130 576.2255 584.8824 612.3283 620.1964 635.7995 657.1957 667.7763 692.7281 699.5706 730.7779 743.9294 762.8936 773.2596 793.6952 800.2019 804.0168 813.7981 841.2134 844.5291 867.8838 894.6686 921.8045 952.2601 967.1710 979.7342 980.5315 987.7807 1001.1631 1012.9425 1014.7911 1029.5817 1032.0838 1045.7900 1069.2296 1086.4124 1103.7060 1118.2368 1140.3834 1145.8602 1172.0946 1191.3579 1202.0964 1216.0551 1229.6276 1240.2361 1250.2949 1251.5249 1319.3081 1326.7446 1348.9240 1365.3761 1368.0303 1377.1086 1384.9230 1398.5075 1400.0396 1436.5866 1443.6183 1449.4611 1463.4175 1468.6284 1475.1941 1476.7552 1482.3508 1485.4300 1493.8414 1498.0954 1528.3546 1558.3629 1572.7471 1583.8335 1609.6571 1616.4274 1655.3522 1699.5693 2903.3495 2964.6375 2987.4875 2994.0208 3006.5528 3064.7918 3075.4590 3091.0397 3104.6636 3124.3152 3127.6834 3131.1576 3136.2834 3149.6174 3161.7383 3172.4157 3435.6596 3556.2801 3570.6984
redmass: 3.7034 3.2676 5.1089 1.9988 2.8697 1.6825 5.8037 4.3545 5.0852 3.8558 2.8018 3.6282 4.7928 4.1852 5.4736 5.9536 6.4782 4.7378 6.7334 1.2552 5.1354 5.1432 6.9144 4.3619 4.3195 4.3382 2.8135 4.7775 1.6499 5.1000 2.3634 5.2477 4.5385 3.1679 2.8678 4.3129 1.5889 6.0608 6.5740 4.0030 7.4769 6.2045 1.6990 7.1595 5.9781 4.7766 2.7247 1.8482 1.3906 1.0963 5.4771 2.5289 4.9351 1.2572 4.2032 6.0248 1.4195 3.5458 5.1050 2.4172 1.3849 5.8741 1.3563 3.0696 1.8930 2.0080 1.6942 3.7910 3.0826 1.6949 2.7874 2.7290 1.4801 3.5451 1.0707 1.1377 1.5416 2.5777 1.1686 3.2540 1.1297 2.2102 1.3777 2.2572 1.7632 2.1768 3.2635 1.2345 7.4729 1.5082 2.4227 2.4153 2.9804 1.3179 1.0408 1.1204 1.3868 1.1856 1.8523 1.6114 1.3277 1.7797 2.3309 4.8888 4.2749 5.6305 5.7308 4.8416 6.6476 9.5378 1.0676 1.0921 1.0373 1.0356 1.0584 1.1063 1.0985 1.0985 1.1025 1.0985 1.0847 1.0925 1.0881 1.0929 1.0962 1.0990 1.0757 1.0761 1.0769
irintensity: 0.0192 1.0333 0.1475 2.2967 0.8738 2.9630 1.4039 3.8126 1.8282 1.3913 3.5507 3.1238 5.4279 5.1693 4.3212 0.3285 0.7173 3.0784 3.0003 0.5375 6.2670 8.6611 1.6392 0.5727 7.8366 4.8666 0.0317 3.6267 64.2378 3.0168 24.1945 28.1861 10.7877 5.0502 83.1498 13.5149 66.1681 0.5500 1.6478 19.6374 1.1973 11.1376 50.8508 23.4863 28.6077 4.4886 10.6484 78.9161 20.4771 4.7177 17.1647 67.4595 18.3619 1.4271 1.6430 13.2817 2.1909 41.9443 105.8865 46.8473 0.3545 0.6099 0.0206 16.1156 4.8873 5.8745 17.8856 445.4900 46.2160 26.9329 245.1949 121.0722 11.9860 317.0024 1.1119 9.8258 1.0454 204.6320 10.1433 84.7533 0.0408 16.9982 2.9942 5.4715 131.9794 117.2441 269.9583 35.5642 9.6204 34.6336 2.0575 50.8094 320.4544 17.7528 11.6056 72.3684 55.1873 96.1283 56.2352 475.5747 242.0336 83.8860 477.6259 26.3376 371.8282 8.1858 288.0980 267.4020 218.5800 249.8986 97.6827 42.4840 8.6914 29.4367 27.3445 7.5918 17.2808 35.0432 47.4366 13.5651 5.2480 19.0001 3.8480 27.9934 30.9137 21.6709 55.9176 54.8987 30.2874
temp: 298.150 k
press: 1.00000 atm
elementType: 8 8 8 7 7 7 7 7 6 6 6 6 6 6 6 6 6 6 6 6 6 6 6 6 6 6 1 1 1 1 1 1 1 1 1 1 1 1 1 1 1 1 1 1 1
symmnumber: 1
zpe: 917507.2 jmol-1
zpe.correction: 0.349460 hartree
zpe.thermalcorrener: 0.373432 hartree
zpe.thermalcorrenthalpy: 0.374376 hartree
zpe.thermalcorrgfe: 0.292372 hartree
zpe.sumelectzpe: -1194.907928 hartree
zpe.sumelectthermal: -1194.883956 hartree
zpe.sumelectthermalent: -1194.883011 hartree
zpe.sumelectthermalfe: -1194.965016 hartree
dipole: -4.9959 -6.7463 -0.2412
dipole: 8.3982
quadrupole: -120.5659 -130.0835 -157.9967
quadrupole: -14.2972 -0.9710 3.4841
quadrupole: 15.6495 6.1318 -21.7813 -14.2972 -0.9710 3.4841
hfenergy: -1195.2573877 hartree
pointgroup: C01 [X(C18H19N5O3)]
dipole: -2.0302105 2.60273 -0.1458014 debye
polarizability: 535.3215722|-8.2932889|272.2351323|8.6100181|-4.8069481|116.8286456 unknown
InChI: InChI=1S/C18H19N5O3/c1-3-26-18(25)23-15-9-13-16(17(22-15)20-11(2)24)21-14(10-19-13)12-7-5-4-6-8-12/h4-9,19-20,23H,3,10H2,1-2H3
charge 0 multiplicity 1
45 atoms
O  5.838642 1.057536 0.039815
O  1.94898 -3.278422 0.879708
O  4.634901 -0.722133 -0.931098
N  -1.073129 2.648093 -0.188327
N  -1.835249 -0.064231 -0.021336
N  1.858273 -0.401321 0.125229
N  0.064304 -1.998667 0.234899
N  3.592873 1.212593 0.011149
C  -2.513639 2.356597 -0.074856
C  -0.082981 1.688652 -0.077944
C  -0.488096 0.321823 0.019224
C  -2.794951 0.841994 -0.082697
C  0.531905 -0.68033 0.128765
C  -4.21045 0.414883 -0.12794
C  1.299025 1.989614 -0.091634
C  2.213254 0.906453 0.003877
C  -5.274416 1.363461 -0.115079
C  -4.542829 -0.971042 -0.178239
C  -6.620417 0.939752 -0.149491
C  -5.884476 -1.39074 -0.213984
C  -6.933402 -0.436923 -0.199667
C  0.742417 -3.196406 0.545219
C  4.65661 0.376553 -0.348623
C  -0.161042 -4.428307 0.41048
C  7.103821 0.355073 -0.311061
C  8.247254 1.225316 0.201757
H  -3.056094 2.829802 -0.919509
H  -2.935752 2.794166 0.858952
H  -0.79658 3.624164 -0.287943
H  1.655302 3.018849 -0.209607
H  -5.065346 2.437467 -0.072094
H  -3.725537 -1.697834 -0.190842
H  -0.957561 -2.040726 0.120602
H  3.87024 2.148306 0.313002
H  -7.424425 1.683927 -0.136767
H  -6.119424 -2.460146 -0.254743
H  -7.978288 -0.764876 -0.227888
H  -1.215808 -4.223806 0.669823
H  0.226781 -5.224184 1.064128
H  -0.127953 -4.795066 -0.632475
H  7.090114 -0.644358 0.159749
H  7.138751 0.216837 -1.407519
H  9.215194 0.744214 -0.029171
H  8.231851 2.220735 -0.2749
H  8.178654 1.360057 1.294856
