program: Gaussian 09
title: 000174573
version: EM64L-G09RevD.01
frameworkgroup: C1[X(C15H9ClF3NO4)]
method: RPBEPBE
basis: SDD
operation: Freq
keyword: #p
keyword: freq=noraman
keyword: PBEPBE/SDD
title: #p freq=noraman PBEPBE/SDD
converged: YES YES NO NO
title: Mulliken charges:
elementType: Cl F F F O O O O N C C C C C C C C C C C C C C C H H H H H H H H H
charge: 0.013236 -0.162330 -0.162089 -0.161017 -0.270091 -0.280050 -0.194925 -0.208244 0.038466 0.488994 0.370290 0.304244 0.279597 -0.458375 -0.328840 -0.317437 -0.329022 -0.334722 -0.365204 -0.027351 -0.258386 0.268181 0.149269 -0.498000 0.306775 0.282872 0.291611 0.272343 0.274625 0.281418 0.243843 0.237554 0.252763
chargesum: 0.00000
title: Mulliken charges with hydrogens summed into heavy atoms:
elementType: Cl F F F O O O O N C C C C C C C C C C C C C C C
charge: 0.013236 -0.162330 -0.162089 -0.161017 -0.270091 -0.280050 -0.194925 -0.208244 0.038466 0.488994 0.370290 0.304244 0.279597 -0.151600 -0.328840 -0.034565 -0.037411 -0.062379 -0.090579 -0.027351 0.023032 0.268181 0.149269 0.236159
polarizability: 3.16149790e+02 1.13659960e+01 2.00097230e+02 2.47648876e+01 -5.55100106e+00 1.31440946e+02
1716.lowfreq: -9.5930 -4.7760 -0.0021 -0.0010 0.0012 4.5513 7.4567 17.0671 24.5884
frequency: -7.4734 16.7690 24.5030 31.0652 33.0901 76.7262 92.1740 97.4111 103.1531 117.7908 135.0813 150.1147 155.9426 192.7735 197.2799 209.2243 239.4703 260.9887 283.1410 304.5161 330.5408 347.8976 354.4670 360.8222 384.6239 402.9622 432.3771 443.5157 452.1916 476.7462 491.9619 533.6169 573.4340 592.4253 614.4645 643.5755 655.3709 664.8330 684.6654 705.0025 736.4197 746.1725 751.1488 783.9594 825.8045 834.3228 853.9952 884.0437 896.2089 916.0958 943.3414 966.1959 986.2590 987.9348 1021.1743 1032.0170 1034.3195 1046.5589 1084.7826 1114.4397 1144.3514 1149.0737 1155.7462 1167.2291 1224.4265 1230.8454 1250.7691 1267.8844 1289.3636 1337.2212 1371.8882 1392.9866 1399.9293 1419.2203 1424.5385 1452.0454 1461.1759 1462.9168 1484.1747 1572.3418 1582.1348 1590.5819 1614.4923 1635.7117 3007.4647 3110.8765 3151.1732 3155.1404 3160.7887 3175.7991 3178.2779 3180.5582 3182.3870
redmass: 16.6964 7.8791 8.3306 9.5815 7.2156 6.0463 6.0462 2.2654 2.1358 3.3180 15.7023 6.3321 6.8825 9.9643 8.3514 6.8196 10.3127 6.1114 8.4479 8.4248 8.5474 6.6240 9.2239 8.6376 8.6955 7.8254 5.7173 3.7993 4.5034 8.0666 7.4384 7.3927 6.3742 8.6915 6.4834 5.9858 7.1700 8.4002 6.0699 5.3273 4.9808 6.3865 7.1606 5.5128 5.1567 1.5200 1.4755 7.2232 1.4376 1.5063 4.5975 1.3762 9.7546 1.3573 8.2637 7.8128 4.3905 3.2067 3.2481 1.2658 1.5458 1.4662 1.5198 1.9079 3.2628 2.5463 1.8182 1.9138 2.7486 7.6078 6.1196 7.2188 4.5873 3.0390 1.4232 1.0505 2.8741 1.0526 3.0462 8.3733 8.5687 6.5946 6.8965 10.5362 1.0296 1.1047 1.0887 1.1050 1.0890 1.0963 1.0941 1.0954 1.0933
irintensity: 0.1175 2.3558 0.6669 0.4739 1.0259 0.9515 1.0173 2.5967 0.9915 1.9594 2.2964 1.0360 1.0724 2.2343 1.0435 5.2960 5.6727 12.3847 5.9211 2.2844 5.1471 0.6272 6.6137 2.3211 0.9644 0.6979 3.3280 17.4315 4.5230 2.4561 3.7702 1.4630 39.0120 5.4964 12.1492 0.8767 5.1549 5.8276 15.5563 14.0177 6.7559 23.5550 29.4366 43.1332 21.1052 60.4006 46.5877 12.7987 36.9599 11.3081 49.8619 4.9841 201.5215 2.6793 350.5086 68.6542 115.2421 87.9688 206.7150 0.2998 90.4081 33.3530 22.0284 103.6476 111.3392 363.9426 271.9780 285.4831 349.5444 71.9974 24.4739 43.3192 25.5245 15.6563 30.1066 16.9222 119.4322 14.1378 62.7490 3.1055 2.0506 350.9954 11.6288 110.3016 28.2729 20.1482 0.5727 11.5160 2.5629 1.9154 0.3743 3.7497 1.8808
temp: 298.150 k
press: 1.00000 atm
elementType: 17 9 9 9 8 8 8 8 7 6 6 6 6 6 6 6 6 6 6 6 6 6 6 6 1 1 1 1 1 1 1 1 1
symmnumber: 1
zpe: 554441.7 jmol-1
zpe.correction: 0.211176 hartree
zpe.thermalcorrener: 0.232710 hartree
zpe.thermalcorrenthalpy: 0.233655 hartree
zpe.thermalcorrgfe: 0.157508 hartree
zpe.sumelectzpe: -1690.434108 hartree
zpe.sumelectthermal: -1690.412574 hartree
zpe.sumelectthermalent: -1690.411629 hartree
zpe.sumelectthermalfe: -1690.487776 hartree
dipole: 2.5051 -0.4190 0.3898
dipole: 2.5696
quadrupole: -197.9877 -133.8191 -139.1071
quadrupole: -0.8952 -5.6229 7.4943
quadrupole: -41.0164 23.1522 17.8642 -0.8952 -5.6229 7.4943
hfenergy: -1690.6452841 hartree
pointgroup: C01 [X(C15H9Cl1F3N1O4)]
dipole: 0.9736831 -0.1786722 0.2051379 debye
polarizability: 316.2931391|10.5954495|194.2012039|25.4436063|-18.9219822|137.1936232 unknown
InChI: InChI=1S/C15H9ClF3NO4/c1-23-14(21)10-7-9(3-4-12(10)20-22)24-13-5-2-8(6-11(13)16)15(17,18)19/h2-7H,1H3
charge 0 multiplicity 1
33 atoms
Cl 2.058405 -2.640915 2.409765
F  5.400676 0.881225 -1.793836
F  5.095528 1.926849 0.190563
F  6.156994 -0.072664 0.127379
O  0.07426 -2.033043 0.270706
O  -2.240264 2.485867 0.910928
O  -3.858184 2.456692 -0.770123
O  -6.073566 -0.919465 -0.73941
N  -5.212634 -0.066404 -0.318731
C  1.259787 -1.299195 0.093148
C  -1.198096 -1.473821 0.037695
C  3.762384 -0.057998 -0.272139
C  -2.792468 0.368968 -0.034347
C  -1.471279 -0.091822 0.153808
C  2.316023 -1.536804 1.00609
C  1.471988 -0.448803 -1.017802
C  3.565389 -0.918776 0.831124
C  2.718593 0.176806 -1.197518
C  -2.222653 -2.412928 -0.235681
C  -3.83321 -0.569204 -0.302886
C  -3.535791 -1.95549 -0.401262
C  5.078569 0.646528 -0.436136
C  -3.060413 1.847828 -0.026862
C  -2.392912 3.960978 0.983372
H  -0.684425 0.6263 0.396156
H  0.667455 -0.296069 -1.74288
H  4.373919 -1.112256 1.541143
H  2.885614 0.824533 -2.06254
H  -1.964392 -3.473844 -0.296673
H  -4.364545 -2.646466 -0.590175
H  -2.124759 4.419557 0.016635
H  -1.704134 4.274261 1.779665
H  -3.435458 4.220175 1.230924
