program: Gaussian 09
title: 000174345
version: EM64L-G09RevD.01
frameworkgroup: C1[X(C12H26O6Si)]
method: RPBEPBE
basis: SDD
operation: Freq
keyword: #p
keyword: freq=noraman
keyword: PBEPBE/SDD
title: #p freq=noraman PBEPBE/SDD
converged: YES YES NO NO
title: Mulliken charges:
elementType: Si O O O O O O C C C C C C C C C C C C H H H H H H H H H H H H H H H H H H H H H H H H H H
charge: 1.490114 -0.597271 -0.598789 -0.300515 -0.282083 -0.298692 -0.286077 -1.065113 -1.085640 -0.285250 -0.255146 -0.243316 -0.219156 -0.304736 -0.243051 -0.252267 -0.249650 -0.296352 -0.213892 0.253701 0.233304 0.245258 0.241426 0.226835 0.313213 0.255609 0.184439 0.193172 0.205215 0.206705 0.226595 0.168767 0.214794 0.201019 0.207409 0.211170 0.175659 0.262101 0.180815 0.205516 0.186806 0.212928 0.192204 0.177999 0.204224
chargesum: 0.00000
title: Mulliken charges with hydrogens summed into heavy atoms:
elementType: Si O O O O O O C C C C C C C C C C C C
charge: 1.490114 -0.597271 -0.598789 -0.300515 -0.282083 -0.298692 -0.286077 -0.332850 -0.304165 0.154798 0.143241 0.189984 0.164405 0.103691 0.143778 0.190649 0.142672 0.108779 0.168330
polarizability: 1.98861770e+02 -2.34153116e-01 1.74780236e+02 -3.12763123e+00 3.91687233e+00 1.48039859e+02
1716.lowfreq: -5.7244 -0.0012 -0.0007 0.0010 6.1832 10.7013 28.1735 36.5313 40.3328
frequency: 28.1050 36.4710 40.2980 44.3870 74.3209 82.8937 101.1707 107.6983 114.7295 120.5395 122.4552 131.5952 138.5504 143.6550 155.2075 177.8042 186.1542 198.5921 203.3728 212.7979 254.3608 276.8048 291.9387 299.8141 315.7157 333.1154 338.9640 360.2622 369.7434 453.5036 459.7405 483.1359 513.9224 534.0921 559.9524 646.7470 697.3546 728.3373 738.5731 770.7558 788.3178 797.9392 814.9441 852.7829 883.9372 893.3881 902.1611 914.4452 924.7517 929.4780 938.0332 943.8083 998.4315 1014.4834 1034.7848 1041.9428 1045.8981 1055.1153 1059.6646 1068.0468 1073.4075 1083.4712 1098.4707 1103.0773 1106.1958 1114.7331 1128.3927 1196.4973 1197.7956 1208.7781 1213.2129 1225.3725 1253.8666 1260.2937 1268.5349 1274.1014 1287.7357 1305.3830 1310.5015 1336.0368 1344.3730 1346.2231 1358.1459 1369.3566 1370.6212 1375.9659 1377.8456 1391.9356 1412.7666 1435.7180 1441.9557 1443.0513 1444.3059 1448.0160 1448.8841 1450.4031 1452.8957 1459.7462 1463.6134 1463.9096 1469.3161 1472.3245 1474.0818 2904.6612 2909.8195 2916.2950 2929.2086 2935.4080 2948.8387 2958.4013 2960.9974 2970.6233 2975.7094 2978.8249 2980.5783 2989.9028 2991.0689 2991.6104 2994.5748 3007.8642 3038.7020 3045.6327 3048.6889 3050.3894 3060.5620 3095.4218 3096.3991 3097.9380 3109.1352
redmass: 3.5149 4.8981 5.2358 4.1431 5.2015 4.0709 2.8218 2.9874 3.2812 1.2342 2.4397 1.0643 3.4298 3.9124 3.7670 2.9707 2.7044 3.3763 2.4520 2.4852 3.8412 3.1443 2.4981 2.4187 2.7122 3.1447 2.8711 4.3697 3.8986 2.8944 2.6085 2.2856 2.5682 2.3847 4.2143 4.0566 4.1910 2.3936 2.8256 3.0241 2.5064 2.5168 1.2475 1.8804 2.2206 2.1369 1.8614 2.1115 2.0500 1.7950 2.2776 2.3219 2.2641 2.6183 2.8250 2.7933 2.6829 3.3255 2.4109 3.4026 2.8656 2.4348 3.4504 3.7891 4.4030 2.8828 2.3896 1.0878 1.0865 1.1026 1.1264 1.1268 1.1000 1.1035 1.1071 1.1291 1.1032 1.2098 1.1984 1.2067 1.2182 1.2720 1.2396 1.2796 1.2694 1.3293 1.2766 1.4033 1.5585 1.0491 1.0672 1.0667 1.0848 1.0520 1.0863 1.0848 1.0808 1.0779 1.0520 1.0788 1.0900 1.0833 1.0791 1.0599 1.0603 1.0596 1.0654 1.0588 1.0571 1.0708 1.0650 1.0571 1.0607 1.0911 1.1003 1.0350 1.0642 1.0663 1.1021 1.1052 1.1050 1.1012 1.1016 1.1004 1.0980 1.0979 1.0984 1.0982 1.0994
irintensity: 0.0849 0.0272 0.4239 0.3993 1.8880 2.0116 4.8432 3.6083 11.5824 1.7895 10.5159 0.5609 1.9534 7.7184 4.2953 8.2367 4.4101 8.3127 3.4195 7.7093 2.7107 0.3758 7.2287 3.2337 0.8558 15.1401 5.1145 21.4710 5.6545 11.9568 10.5179 15.2552 1.5021 5.7993 3.6480 31.0631 35.8111 17.9144 7.6882 4.1042 5.8238 13.4305 1.2989 91.6558 16.3445 21.0823 56.5824 20.6010 28.0211 6.5886 271.8522 194.1344 13.4644 22.6542 3.6081 29.0614 106.2398 5.9200 46.0849 208.5318 112.6168 23.3067 36.3184 3.8288 134.9012 33.0517 54.3824 2.6114 4.7478 5.1439 5.8547 2.3908 2.4894 16.5890 10.0055 7.5158 7.5863 60.9525 57.6330 27.6763 10.4246 10.3604 6.3944 8.3861 0.3958 10.8866 5.5049 3.1083 6.3201 3.4493 0.4746 4.7372 14.3138 5.2814 13.6391 9.1227 4.7039 4.2912 10.6369 10.1392 2.4094 10.3912 11.7802 67.3799 21.3429 58.5989 58.1907 139.7761 94.6169 19.3094 67.3648 55.0968 58.5371 108.4623 55.0301 8.7662 27.4050 43.6658 53.4050 59.4865 20.8259 27.1900 7.2074 45.7235 29.6964 9.2139 10.8492 26.0063 0.5485
temp: 298.150 k
press: 1.00000 atm
elementType: 14 8 8 8 8 8 8 6 6 6 6 6 6 6 6 6 6 6 6 1 1 1 1 1 1 1 1 1 1 1 1 1 1 1 1 1 1 1 1 1 1 1 1 1 1
symmnumber: 1
zpe: 989901.2 jmol-1
zpe.correction: 0.377033 hartree
zpe.thermalcorrener: 0.400863 hartree
zpe.thermalcorrenthalpy: 0.401807 hartree
zpe.thermalcorrgfe: 0.322876 hartree
zpe.sumelectzpe: -1212.012516 hartree
zpe.sumelectthermal: -1211.988686 hartree
zpe.sumelectthermalent: -1211.987742 hartree
zpe.sumelectthermalfe: -1212.066673 hartree
dipole: -3.3752 3.1880 -0.1600
dipole: 4.6455
quadrupole: -109.8642 -111.7330 -122.2838
quadrupole: -1.1032 -2.6380 1.9757
quadrupole: 4.7628 2.8940 -7.6568 -1.1032 -2.6380 1.9757
hfenergy: -1212.3895492 hartree
pointgroup: C01 [X(C12H26O6Si1)]
dipole: -1.4980315 -1.0448439 -0.0677807 debye
polarizability: 198.3947888|-3.720323|174.00433|3.3372821|6.5953763|149.2827455 unknown
InChI: InChI=1S/C12H26O6Si/c1-19(2)17-11-9-15-7-5-13-3-4-14-6-8-16-10-12-18-19/h3-12H2,1-2H3
charge 0 multiplicity 1
45 atoms
Si 3.300471 0.019763 -0.055872
O  2.334207 0.659387 -1.351081
O  2.524936 -1.391035 0.619791
O  0.549839 2.19184 0.637121
O  -0.240835 -2.37804 -0.315078
O  -2.623703 2.255359 0.133864
O  -2.84346 -0.769775 -0.012643
C  4.912058 -0.439214 -0.945495
C  3.520301 1.178381 1.416557
C  0.880956 0.838483 -1.390407
C  2.179253 -2.601154 -0.111253
C  0.418826 2.188482 -0.838198
C  0.826885 -3.126977 0.361327
C  -0.582864 2.759395 1.372163
C  -1.572414 -2.842928 0.08101
C  -1.847037 1.894466 1.342257
C  -2.612507 -2.048319 -0.695688
C  -3.838361 1.45845 -0.050096
C  -3.60672 0.169285 -0.84009
H  5.30796 0.436864 -1.489624
H  5.680238 -0.780924 -0.22874
H  4.742586 -1.241988 -1.685182
H  3.877004 0.617048 2.297951
H  4.251214 1.973577 1.18375
H  2.550529 1.650992 1.646213
H  0.368243 0.01636 -0.852963
H  0.609021 0.788902 -2.463554
H  2.950519 -3.373413 0.091429
H  2.132158 -2.429124 -1.207539
H  1.047059 3.003572 -1.250285
H  -0.638602 2.350031 -1.123584
H  0.735144 -4.210421 0.112552
H  0.754025 -3.00422 1.462634
H  -0.832861 3.779949 1.011101
H  -0.217196 2.832155 2.412174
H  -1.734122 -2.705484 1.172042
H  -1.678311 -3.926783 -0.156032
H  -1.582127 0.820965 1.326099
H  -2.469238 2.105481 2.241265
H  -2.240526 -1.880991 -1.729273
H  -3.568403 -2.61605 -0.749081
H  -4.52993 2.102854 -0.624253
H  -4.304807 1.217757 0.92903
H  -4.593585 -0.271584 -1.118333
H  -3.048522 0.395423 -1.774884
