program: Gaussian 09
title: 000174280
version: EM64L-G09RevD.01
frameworkgroup: C1[X(C15H24O)]
method: RPBEPBE
basis: SDD
operation: Freq
keyword: #pfreq=noraman
keyword: PBEPBE/SDD
title: #p freq=noraman PBEPBE/SDD
converged: NO YES NO NO
title: Mulliken charges:
elementType: O C C C C C C C C C C C C C C C H H H H H H H H H H H H H H H H H H H H H H H H
charge: -0.443566 0.424160 -0.211388 -0.242376 -0.499227 0.001385 -0.529568 -0.527533 -0.502787 0.741524 -0.326924 -0.829580 -0.072799 -0.835715 -0.735457 -0.739241 0.277828 0.232569 0.236014 0.181644 0.210108 0.199827 0.208247 0.211116 0.214151 0.205152 0.208276 0.213442 0.227395 0.220022 0.211988 0.227681 0.224925 0.201892 0.209071 0.232808 0.203988 0.209363 0.232811 0.328776
chargesum: 0.00000
title: Mulliken charges with hydrogens summed into heavy atoms:
elementType: O C C C C C C C C C C C C C C C
charge: -0.114790 0.424160 0.066440 -0.009806 -0.263213 0.183029 -0.119633 -0.108170 -0.083485 0.741524 -0.118648 -0.168721 0.139189 -0.383109 -0.091686 -0.093080
polarizability: 1.72246257e+02 2.43126575e+00 1.52017757e+02 -7.22117802e+00 2.94104258e-01 1.46745532e+02
1716.lowfreq: -18.2307 -14.0879 -11.2031 -0.0006 -0.0004 -0.0003 54.5604 69.0374 86.6782
frequency: 54.2832 68.8328 86.6570 114.8070 149.7556 175.7146 195.6835 208.7380 221.6948 235.0837 239.4604 250.9201 261.3519 303.7595 304.9252 341.1741 373.6331 385.5473 410.5685 431.9121 437.8817 447.6008 484.3924 540.3827 584.6388 609.9038 653.1359 672.9983 710.7853 794.7085 806.9132 821.6309 845.0094 850.4924 880.5199 894.7589 907.7971 914.9515 918.0519 938.8625 950.4053 952.7749 963.7801 970.1722 990.6534 1005.1027 1016.5527 1038.6096 1055.6061 1074.0211 1098.5977 1117.3054 1125.2570 1144.2776 1152.2767 1169.6294 1175.8448 1179.9060 1200.3925 1204.2426 1211.6895 1215.7180 1242.9577 1260.1743 1270.4332 1275.6969 1293.8558 1297.1055 1302.4141 1313.9310 1318.1392 1328.6337 1335.1695 1340.7699 1362.4721 1365.3874 1379.4235 1385.1985 1395.0515 1436.3032 1452.8827 1462.0817 1467.4115 1470.4508 1474.3766 1478.9126 1481.3612 1485.1538 1495.1386 1667.5422 2922.3271 2951.7684 2956.9949 2957.7216 2966.5517 2967.3437 2971.0276 2973.7058 2974.9595 2999.4628 3014.0095 3022.9326 3029.8416 3044.4176 3050.2529 3054.8702 3062.4171 3072.5004 3072.8949 3077.6978 3082.9315 3085.7269 3187.4709 3522.0415
redmass: 2.5813 3.1710 4.1518 3.0104 2.0061 1.3729 1.1862 2.4631 1.8316 2.0878 1.7096 2.1507 1.3970 2.9716 2.1310 2.3283 2.3545 2.2808 2.5423 2.6654 2.5767 2.8616 4.1815 3.4956 2.9845 3.0864 3.1977 3.7607 1.2547 2.5420 2.0236 2.5513 2.4695 3.0770 2.1325 2.2398 2.1281 1.6613 1.5894 2.0921 1.4370 1.4805 2.1398 1.7166 1.9095 2.1203 2.1363 1.7106 1.4485 1.8134 2.3010 1.5841 1.5195 1.6944 2.0205 1.5806 1.5054 1.8420 1.6419 1.7186 1.9896 1.6792 1.4622 1.3494 1.3789 1.6142 1.4812 1.4589 1.4801 1.4715 1.4061 1.3153 1.5762 1.4912 1.7107 1.6157 1.2236 1.2305 1.2057 1.1968 1.0900 1.0651 1.0527 1.0642 1.0626 1.0570 1.0619 1.0619 1.0504 5.5877 1.0812 1.0845 1.0699 1.0678 1.0388 1.0368 1.0374 1.0692 1.0669 1.0855 1.0970 1.1002 1.0883 1.0998 1.0979 1.0986 1.0978 1.0972 1.0944 1.0965 1.0933 1.0626 1.1139 1.0658
irintensity: 0.0303 0.1392 0.7470 0.5657 0.1130 0.4107 0.3282 0.4110 3.1571 11.0360 3.0200 10.5099 122.7752 4.2751 1.1847 1.8815 0.7352 1.6680 0.4182 6.3837 0.3024 0.2870 0.5483 0.4195 5.3251 0.5978 0.2727 4.2716 3.5838 0.2065 3.3444 3.6897 15.9168 0.6302 0.3263 0.7797 14.6986 12.6529 14.0929 10.1942 58.5505 5.5373 8.5359 1.0949 31.3436 3.0845 4.1099 6.2011 2.0422 5.3134 2.2041 3.5115 5.3536 5.0207 6.0696 2.1550 30.9280 2.8304 2.2848 3.9725 3.7745 15.2666 3.0628 5.9734 4.6477 0.6074 3.4184 1.5422 2.2527 3.4267 1.2599 1.9497 3.9123 0.4232 7.2947 7.4318 18.6374 16.3529 22.6940 15.1772 9.4816 5.3784 3.0907 2.3683 12.9847 3.5416 5.0422 4.9036 17.4604 23.0090 12.3748 27.8495 33.6026 33.8317 52.1902 26.0283 51.5243 85.6993 13.4332 73.0706 37.4722 41.5811 26.3801 47.6669 39.4071 1.0016 97.6126 38.8921 22.4690 57.2205 19.3577 9.4970 18.0670 3.3708
temp: 298.150 k
press: 1.00000 atm
elementType: 8 6 6 6 6 6 6 6 6 6 6 6 6 6 6 6 1 1 1 1 1 1 1 1 1 1 1 1 1 1 1 1 1 1 1 1 1 1 1 1
symmnumber: 1
zpe: 929516.5 jmol-1
zpe.correction: 0.354034 hartree
zpe.thermalcorrener: 0.370418 hartree
zpe.thermalcorrenthalpy: 0.371363 hartree
zpe.thermalcorrgfe: 0.312004 hartree
zpe.sumelectzpe: -659.905380 hartree
zpe.sumelectthermal: -659.888996 hartree
zpe.sumelectthermalent: -659.888051 hartree
zpe.sumelectthermalfe: -659.947410 hartree
dipole: -0.5495 1.0316 -1.6307
dipole: 2.0063
quadrupole: -96.2469 -102.1189 -95.7226
quadrupole: 1.7863 4.0948 4.8184
quadrupole: 1.7826 -4.0894 2.3068 1.7863 4.0948 4.8184
hfenergy: -660.259414 hartree
pointgroup: C01 [X(C15H24O1)]
dipole: 0.1883067 0.4239206 0.638669 debye
polarizability: 172.5327675|-1.256128|151.7849504|-7.0574166|-0.7807495|146.691828 unknown
InChI: InChI=1S/C15H24O/c1-8(2)10-5-6-15(4)11-7-12(16)9(3)14(15)13(10)11/h8,10-14,16H,3,5-7H2,1-2,4H3
charge 0 multiplicity 1
40 atoms
O  1.969496 -2.449454 0.357462
C  0.69467 1.534164 0.156405
C  -0.318404 -0.372223 0.354514
C  0.593279 0.470317 1.322045
C  0.531409 0.275392 -0.818127
C  -1.795355 0.10186 0.379249
C  -0.606587 2.383425 0.14991
C  1.937381 -0.243937 1.576015
C  -1.863783 1.545846 -0.197585
C  1.85192 -0.446232 -0.973681
C  2.428196 -1.027176 0.318732
C  1.931959 2.429119 0.03626
C  -2.760049 -0.872602 -0.369766
C  2.509439 -0.576934 -2.152708
C  -2.810522 -2.270202 0.296624
C  -4.197574 -0.301255 -0.463399
H  -0.222936 -1.463649 0.450532
H  0.138487 0.826004 2.266509
H  0.047388 0.450096 -1.794402
H  -2.117319 0.124268 1.445689
H  -0.507732 3.21293 -0.578695
H  -0.715409 2.853097 1.149719
H  1.833143 -0.953278 2.422151
H  2.702566 0.49812 1.877057
H  -2.776466 2.067853 0.143814
H  -1.944656 1.471517 -1.300819
H  3.537877 -1.023571 0.27701
H  1.963155 3.16749 0.861431
H  2.877185 1.859171 0.051879
H  1.909959 2.993599 -0.915754
H  -2.370245 -0.995922 -1.404392
H  3.473031 -1.095703 -2.218311
H  2.090998 -0.190732 -3.090036
H  -3.178578 -2.189565 1.338539
H  -3.500777 -2.938317 -0.251721
H  -1.822709 -2.762013 0.320891
H  -4.608332 -0.110039 0.547747
H  -4.869416 -1.020786 -0.967689
H  -4.235814 0.64559 -1.029912
H  2.299228 -2.850468 1.20431
