program: Gaussian 09
title: 000174264
version: EM64L-G09RevD.01
frameworkgroup: C1[X(C11H10F13NO5S2)]
method: RPBEPBE
basis: SDD
operation: Freq
keyword: #p
keyword: freq=noraman
keyword: PBEPBE/SDD
title: #p freq=noraman PBEPBE/SDD
converged: YES YES NO NO
title: Mulliken charges:
elementType: S S F F F F F F F F F F F F F O O O O O N C C C C C C C C C C C H H H H H H H H H H
charge: 0.149422 0.962472 -0.126616 -0.134387 -0.124291 -0.133311 -0.162528 -0.160510 -0.131421 -0.118139 -0.115329 -0.124856 -0.120916 -0.123281 -0.123984 -0.294953 -0.284275 -0.598352 -0.469230 -0.474397 -0.353447 0.218671 0.251706 0.300707 0.252311 -0.499380 0.206958 -0.263481 0.372890 0.304186 -0.387712 -0.695393 0.275204 0.268129 0.256635 0.255340 0.274431 0.273135 0.378913 0.318328 0.308570 0.392184
chargesum: 0.00000
title: Mulliken charges with hydrogens summed into heavy atoms:
elementType: S S F F F F F F F F F F F F F O O O O O N C C C C C C C C C C C
charge: 0.149422 0.962472 -0.126616 -0.134387 -0.124291 -0.133311 -0.162528 -0.160510 -0.131421 -0.118139 -0.115329 -0.124856 -0.120916 -0.123281 -0.123984 -0.294953 -0.284275 -0.206168 -0.469230 -0.474397 0.025466 0.218671 0.251706 0.300707 0.252311 0.043952 0.206958 0.248493 0.372890 0.304186 0.159854 -0.068495
polarizability: 2.45117572e+02 -2.76761539e+01 2.08259354e+02 1.56462866e+01 -2.07940707e+01 1.82520124e+02
1716.lowfreq: -15.2374 -5.6086 -0.0001 0.0013 0.0015 1.1028 3.0930 8.4641 17.0895
frequency: -12.1182 8.3700 17.0551 26.7291 28.5943 38.6598 44.6877 54.0786 58.0537 63.3979 68.5999 85.8315 90.6185 105.1668 108.1145 118.1683 125.5386 133.3306 145.0220 157.3750 162.3576 166.4280 174.5164 184.2227 195.8932 212.9145 215.0554 216.7386 238.7183 246.6176 253.2176 255.0475 270.0106 283.0677 285.4620 293.9998 298.6181 303.0660 304.4032 315.3118 318.1886 325.5147 331.4082 356.2585 383.3585 406.1098 408.7591 421.1016 441.2394 452.4223 463.2013 498.4874 510.0257 522.8835 524.3312 556.8913 565.2408 584.7414 588.0535 600.6386 653.5175 656.5257 689.6626 704.9119 733.4297 788.1796 803.6860 820.4836 843.0438 873.4455 881.2955 915.3976 933.3991 944.7041 960.3479 971.2392 985.1408 1007.9293 1014.1808 1026.7491 1030.8904 1038.0703 1041.3887 1043.4874 1074.3503 1080.7941 1089.7498 1113.3604 1117.7472 1132.2712 1135.8698 1149.7343 1157.9125 1167.5184 1185.7559 1189.5226 1207.6760 1211.7070 1249.2262 1284.1234 1286.0126 1327.1494 1359.1937 1390.5436 1398.3304 1447.1183 1452.7058 1481.3425 1495.2585 1656.7428 2984.5725 3022.3199 3028.4313 3039.2176 3089.4363 3092.5706 3102.5790 3111.4604 3471.9660 3513.2926
redmass: 9.8113 14.5158 12.0999 12.7455 12.7332 15.3501 7.6578 10.7154 10.6746 15.2513 6.5913 8.0358 4.2192 8.2666 15.7721 4.6640 4.8964 16.7693 9.1788 9.7702 4.1735 2.8230 11.9913 6.9592 17.5870 7.3294 4.6520 3.0428 17.0173 10.0055 8.0025 16.7630 13.0758 18.0624 14.1723 6.8240 17.5200 6.7303 18.0854 9.4334 3.9542 6.7245 11.7126 6.3372 7.3411 13.2256 10.5501 11.4198 10.0490 5.1649 17.6109 16.1156 13.1288 10.9570 4.2811 14.4265 14.0143 16.2636 17.0561 3.6707 7.8262 3.8517 1.5279 9.7609 5.0616 1.3388 2.0925 10.8495 13.8903 9.1991 4.3131 2.9521 6.4926 3.0419 8.4293 10.2139 6.4654 5.1092 11.4454 8.6356 2.4269 12.5323 1.2271 11.7093 9.6221 10.4504 5.0740 3.1997 4.7312 5.9216 8.8870 10.7924 11.3152 1.2416 4.0811 10.4432 1.2218 1.8005 1.3848 1.1272 1.1367 1.4380 1.2454 1.4611 1.0879 1.0894 1.1107 1.5022 1.2469 9.3137 1.0625 1.0617 1.0582 1.0590 1.1055 1.0999 1.1021 1.1058 1.0662 1.0789
irintensity: 0.1618 0.0690 0.3994 0.6690 0.2927 0.2558 0.1898 0.7371 0.0089 0.8521 3.8440 1.5071 2.1099 2.2180 0.3249 4.3448 5.6767 0.8357 1.4138 2.0538 19.7775 19.1492 0.9514 8.4630 11.6939 5.8604 9.0417 43.9579 1.6142 6.3763 7.3345 0.6301 5.0171 1.2184 1.2094 24.4210 1.8178 17.6903 0.5322 1.9880 7.7078 2.7362 3.9939 20.8495 11.1540 43.7045 6.5923 6.1983 0.3338 2.0646 9.0723 104.2233 6.8539 5.0018 5.8376 3.3977 9.4876 3.0762 2.2691 20.8366 36.9759 36.9143 88.0325 37.0975 52.0421 1.1560 23.4178 230.7012 88.2752 59.4733 55.5886 75.4577 167.5002 11.4941 64.9201 30.2700 31.9698 33.9994 141.9327 62.5633 139.7207 75.1983 82.9897 45.7984 195.3457 288.9640 166.9572 70.6815 18.5468 167.5606 21.1987 40.3435 3.5980 15.2159 38.8878 34.4807 20.2633 181.4111 61.7396 105.0434 3.8004 29.1178 28.8758 70.7787 18.6284 20.4278 23.3977 330.7013 125.0828 277.4712 16.0700 11.8789 11.2350 3.8577 3.3011 7.8445 4.8788 7.3918 47.6395 59.7635
temp: 298.150 k
press: 1.00000 atm
elementType: 16 16 9 9 9 9 9 9 9 9 9 9 9 9 9 8 8 8 8 8 7 6 6 6 6 6 6 6 6 6 6 6 1 1 1 1 1 1 1 1 1 1
symmnumber: 1
zpe: 605732.6 jmol-1
zpe.correction: 0.230711 hartree
zpe.thermalcorrener: 0.265523 hartree
zpe.thermalcorrenthalpy: 0.266467 hartree
zpe.thermalcorrgfe: 0.159952 hartree
zpe.sumelectzpe: -2947.404982 hartree
zpe.sumelectthermal: -2947.370170 hartree
zpe.sumelectthermalent: -2947.369226 hartree
zpe.sumelectthermalfe: -2947.475741 hartree
dipole: 1.9309 0.3690 1.3474
dipole: 2.3833
quadrupole: -213.8731 -214.2521 -192.7039
quadrupole: 14.5714 2.0697 1.9524
quadrupole: -6.9301 -7.3090 14.2391 14.5714 2.0697 1.9524
hfenergy: -2947.6356932 hartree
pointgroup: C01 [X(C11H10F13N1O5S2)]
dipole: 0.7745962 0.1733626 0.4991493 debye
polarizability: 244.017775|-27.641986|205.5370878|16.5972019|-23.0417433|186.3421869 unknown
InChI: InChI=1S/C11H9F13NO2S.HO3S/c12-6(13,1-3-27-5(26)25-2-4-28)7(14,15)8(16,17)9(18,19)10(20,21)11(22,23)24;1-4(2)3/h25H,1-4H2;1H
charge 0 multiplicity 1
42 atoms
S  5.95343 -1.59027 -1.37845
S  7.29844 -1.857736 0.616043
F  -3.584099 1.958267 0.362759
F  -2.19268 2.108101 2.170832
F  -3.793618 -0.063169 2.210135
F  -1.558513 -0.517843 2.070896
F  -1.211661 3.223907 -0.091615
F  -1.482906 1.310595 -1.303686
F  -1.791262 -1.29976 -0.546212
F  -3.094007 -2.393705 0.971439
F  -4.014022 0.007749 -1.600057
F  -4.116005 -2.272413 -1.527089
F  -6.557238 -1.2393 -1.183341
F  -5.843585 -2.014353 0.824693
F  -5.901845 0.220942 0.416615
O  2.546083 1.318069 0.126985
O  3.724244 2.264555 -1.686863
O  6.014841 -1.052148 1.740091
O  7.467431 -3.389345 1.08186
O  8.575088 -0.867987 0.578261
N  4.809889 1.068949 0.014976
C  -2.401879 1.43647 0.93376
C  -2.684823 -0.064434 1.330364
C  -1.180493 1.793978 0.010448
C  -2.957432 -1.182425 0.251194
C  0.193039 1.331799 0.464334
C  -4.183074 -1.096955 -0.741488
C  1.301836 1.870851 -0.453359
C  -5.641208 -1.030597 -0.147924
C  3.714341 1.605387 -0.613399
C  6.137741 1.193017 -0.573291
C  6.420336 0.195651 -1.72909
H  0.364815 1.679138 1.497965
H  0.231094 0.229661 0.468452
H  1.349352 2.972892 -0.450431
H  1.18859 1.524004 -1.494901
H  6.253803 2.207168 -0.996459
H  6.887319 1.060489 0.223792
H  4.694527 0.453223 0.825755
H  5.765228 0.43944 -2.590881
H  7.474253 0.238078 -2.046908
H  6.236332 -1.289041 2.687892
