program: Gaussian 09
title: 000174237
version: EM64L-G09RevD.01
frameworkgroup: C1[X(C11H17N3O2)]
method: RPBEPBE
basis: SDD
operation: Freq
keyword: #p
keyword: freq=noraman
keyword: PBEPBE/SDD
title: #p freq=noraman PBEPBE/SDD
converged: NO YES NO NO
title: Mulliken charges:
elementType: O O N N N C C C C C C C C C C C H H H H H H H H H H H H H H H H H
charge: -0.219768 -0.231575 -0.076637 -0.458310 -0.397987 0.088242 -0.130489 0.272924 -0.622456 -0.542754 -0.505193 -0.509845 -0.372354 0.135664 -0.663539 0.152655 0.258048 0.227254 0.240354 0.256600 0.254759 0.233367 0.216768 0.212729 0.233361 0.219536 0.196882 0.222174 0.320996 0.236318 0.166776 0.237851 0.347649
chargesum: 0.00000
title: Mulliken charges with hydrogens summed into heavy atoms:
elementType: O O N N N C C C C C C C C C C C
charge: -0.219768 -0.231575 -0.076637 -0.137314 -0.050338 0.346290 0.096765 0.272924 -0.125502 -0.054629 -0.075696 -0.056948 0.046701 0.135664 -0.022593 0.152655
polarizability: 1.75711137e+02 -9.89873513e+00 1.31220550e+02 9.02617623e-01 7.33855986e-01 1.10724412e+02
1716.lowfreq: -14.0379 -4.6031 -0.0006 -0.0006 -0.0005 10.9116 21.0130 58.6219 130.3229
frequency: 20.6455 58.5998 130.3195 158.3116 173.2926 214.3345 219.7282 225.6510 245.1607 262.9354 289.5442 343.3997 347.6475 385.8572 422.9924 461.3721 471.6908 506.4924 535.7219 553.4266 597.4960 605.3601 618.5878 646.3841 686.6416 698.1742 718.2893 720.0501 732.8907 754.7316 783.9627 840.3715 843.9519 886.9898 934.5400 940.4011 958.8921 966.1757 986.4298 1010.4319 1021.4796 1043.5056 1070.1073 1100.3280 1114.3325 1126.4128 1147.7397 1158.7050 1178.9758 1184.4800 1204.4960 1213.7397 1233.1539 1261.9140 1270.8173 1279.3658 1287.8266 1297.6440 1305.0419 1305.6507 1315.9767 1323.0288 1340.0247 1353.0879 1422.8412 1430.7872 1448.1939 1452.4966 1466.5669 1467.8010 1470.6141 1480.9485 1490.0154 1561.7791 1673.7383 1720.4501 2822.1689 2941.4935 2979.4265 2986.8468 2988.2475 3001.7705 3006.9017 3009.9566 3011.9015 3040.5123 3059.9680 3062.8083 3069.7190 3074.6398 3085.7151 3588.7956 3597.0202
redmass: 4.1328 7.1039 3.6445 8.7203 2.7084 2.0462 2.7780 1.1554 2.4382 3.4519 3.5539 2.7977 2.3683 8.0149 3.0329 3.7851 3.8809 1.1986 2.9377 4.0129 4.0039 7.4913 2.4045 1.1525 4.0555 7.4960 4.5222 3.7301 6.4106 3.3266 2.0822 1.6860 3.1169 2.1147 2.3168 2.5142 4.3502 3.0842 2.4168 2.6743 2.6120 1.9392 2.5200 2.8576 1.4407 1.2462 1.5228 1.5218 1.8895 1.6723 1.2288 1.7933 2.0237 1.6911 1.4891 1.2843 1.6953 1.2556 1.5524 1.7101 4.6439 1.4473 1.5919 1.7398 1.1918 1.1346 1.0859 1.0759 1.1046 1.0789 1.0721 1.0856 1.0650 1.0622 8.3712 9.4651 1.0582 1.0784 1.0649 1.0741 1.0638 1.0655 1.0644 1.0666 1.0615 1.1005 1.1025 1.1034 1.1034 1.1021 1.1017 1.0802 1.0798
irintensity: 1.0996 0.0748 0.2949 3.2294 2.7137 0.2944 0.0875 0.9720 2.2320 0.0349 0.3698 0.2623 2.7925 24.6158 1.9617 12.7442 3.8508 71.0070 1.7452 12.0063 6.8473 6.4292 10.1635 141.2349 15.8075 7.6061 2.7207 1.3338 44.2165 7.3397 5.9870 4.5838 7.2887 4.3908 3.7450 1.6197 16.7432 2.6337 9.7446 8.3250 19.0147 20.3314 3.6994 6.3537 1.4657 4.9645 15.7816 19.3045 19.1396 30.9296 8.4277 6.7905 10.8088 68.2530 21.5842 12.5831 16.5065 5.4317 41.0270 51.1697 151.0158 2.7475 13.3170 4.4367 1.7321 9.1983 5.3472 6.3577 1.2540 12.9357 9.4755 13.3844 0.4613 4.0603 464.6902 525.9271 202.7574 4.4381 18.1497 2.7997 63.4535 61.8759 84.7139 50.9541 24.6626 50.0766 7.1506 8.2744 23.0036 16.9647 63.2896 79.3830 30.1878
temp: 298.150 k
press: 1.00000 atm
elementType: 8 8 7 7 7 6 6 6 6 6 6 6 6 6 6 6 1 1 1 1 1 1 1 1 1 1 1 1 1 1 1 1 1
symmnumber: 1
zpe: 726790.2 jmol-1
zpe.correction: 0.276820 hartree
zpe.thermalcorrener: 0.290950 hartree
zpe.thermalcorrenthalpy: 0.291894 hartree
zpe.thermalcorrgfe: 0.236081 hartree
zpe.sumelectzpe: -742.792875 hartree
zpe.sumelectthermal: -742.778744 hartree
zpe.sumelectthermalent: -742.777800 hartree
zpe.sumelectthermalfe: -742.833614 hartree
dipole: 2.4797 1.5322 0.3641
dipole: 2.9375
quadrupole: -112.9969 -97.5165 -92.7080
quadrupole: 7.0504 1.3870 0.4116
quadrupole: -11.9231 3.5573 8.3658 7.0504 1.3870 0.4116
hfenergy: -743.0696944 hartree
pointgroup: C01 [X(C11H17N3O2)]
dipole: -0.9883263 -0.5809568 0.1461327 debye
polarizability: 175.2440839|-10.8789776|131.6816459|-1.094079|-0.6894002|110.73037 unknown
InChI: InChI=1S/C11H17N3O2/c1-14-7-3-2-4-8(14)6-11(5-7)9(15)12-10(16)13-11/h7-8,12-13H,2-6H2,1H3
charge 0 multiplicity 1
33 atoms
O  0.992907 2.396457 -0.030648
O  4.297427 -0.967676 -0.016171
N  -1.891105 -1.091946 0.007506
N  1.913614 -1.045497 0.04539
N  2.885734 0.967181 -0.052072
C  -1.475706 0.036901 -0.903834
C  -1.656949 -0.450033 1.302191
C  0.771788 -0.107247 0.009122
C  -0.049027 -0.232734 -1.381347
C  -0.084234 -0.151105 1.390831
C  -2.790824 0.629452 -1.420379
C  -2.63986 0.807866 1.263881
C  -3.560651 0.83444 -0.032698
C  1.523785 1.258907 -0.026767
C  -1.432726 -2.463324 -0.203039
C  3.160425 -0.44153 -0.00861
H  -1.212454 0.891743 -0.250762
H  -1.92919 -1.116111 2.144654
H  0.122346 -1.225955 -1.83149
H  0.318545 0.531081 -2.089329
H  0.086989 0.801237 1.926841
H  0.383967 -0.948939 1.995857
H  -3.371949 -0.034164 -2.083763
H  -2.626709 1.596038 -1.935265
H  -2.05955 1.748459 1.346879
H  -3.311403 0.777515 2.142907
H  -4.114349 1.793634 -0.044866
H  -4.300959 0.023581 0.069522
H  1.814011 -2.058971 0.050045
H  -1.958379 -3.1174 0.517257
H  -0.335162 -2.655488 -0.070747
H  -1.705291 -2.802216 -1.218027
H  3.630938 1.663143 -0.08307
