program: Gaussian 09
title: 000173964
version: EM64L-G09RevD.01
frameworkgroup: C1[X(C8H6ClNOS)]
method: RPBEPBE
basis: SDD
operation: Freq
keyword: #p
keyword: freq=noraman
keyword: PBEPBE/SDD
title: #p freq=noraman PBEPBE/SDD
converged: NO YES NO YES
title: Mulliken charges:
elementType: Cl S O N C C C C C C C C H H H H H H
charge: -0.039399 0.246918 -0.178019 -0.208550 0.746841 -0.412299 -0.248385 -0.099433 -0.260054 -0.621830 -0.218943 -0.235089 0.268640 0.253617 0.253595 0.252822 0.258108 0.241462
chargesum: 0.00000
title: Mulliken charges with hydrogens summed into heavy atoms:
elementType: Cl S O N C C C C C C C C
charge: -0.039399 0.246918 -0.178019 -0.208550 0.746841 -0.412299 -0.248385 -0.099433 -0.007232 0.154022 0.039164 0.006373
polarizability: 1.60345155e+02 -8.66549569e+00 1.48399839e+02 -3.12562876e-03 2.05008200e-03 4.93024350e+01
1716.lowfreq: -7.7406 -0.0029 -0.0006 -0.0003 6.4490 10.6009 53.9466 105.1100 185.8785
frequency: 53.9082 105.1031 185.8784 197.9659 200.4173 205.0937 290.4624 320.5914 362.2903 365.0051 418.8132 473.5218 488.3566 500.3008 537.8292 542.0914 610.1880 687.1601 716.3411 762.7172 767.4962 833.0351 889.8710 961.0463 973.1140 1035.3332 1072.2067 1122.5255 1122.9961 1157.4113 1195.1961 1267.3537 1306.0883 1378.8293 1419.9000 1435.3038 1461.8021 1481.3055 1483.0503 1566.9974 1597.9500 1661.0415 3017.4248 3119.5626 3130.2262 3153.0840 3167.1853 3182.5345
redmass: 4.6994 9.0977 1.8004 16.5793 1.7143 4.3729 4.9228 6.0848 5.6559 6.4584 14.2424 12.1437 8.6462 5.3379 4.0649 5.8940 9.5282 7.2387 4.6622 9.2833 1.3515 5.3408 1.3497 1.3277 4.5396 3.8476 2.6528 1.2987 2.4959 1.4634 1.4955 2.2854 3.7890 4.8213 2.0206 1.7861 2.0283 1.1917 1.0434 7.0028 8.2204 11.0022 1.0325 1.1033 1.1021 1.0868 1.0928 1.0999
irintensity: 3.6065 1.8096 2.0981 0.7642 1.4285 1.0479 0.4521 2.2998 0.1363 14.6651 11.4937 6.6314 1.2973 0.0033 0.8184 8.2166 3.2204 10.4799 24.7458 35.1896 59.8950 18.8106 0.0442 0.6841 29.2071 80.6647 26.8771 0.0765 31.3099 9.5997 23.2638 29.2455 20.2048 14.0589 11.3661 18.0069 83.8032 96.9635 20.8256 29.2676 9.3262 531.3615 24.9562 14.5047 0.8901 1.9662 2.7824 7.4655
temp: 298.150 k
press: 1.00000 atm
elementType: 17 16 8 7 6 6 6 6 6 6 6 6 1 1 1 1 1 1
symmnumber: 1
zpe: 322895.5 jmol-1
zpe.correction: 0.122984 hartree
zpe.thermalcorrener: 0.133513 hartree
zpe.thermalcorrenthalpy: 0.134457 hartree
zpe.thermalcorrgfe: 0.086205 hartree
zpe.sumelectzpe: -1295.713023 hartree
zpe.sumelectthermal: -1295.702494 hartree
zpe.sumelectthermalent: -1295.701550 hartree
zpe.sumelectthermalfe: -1295.749803 hartree
dipole: -3.2274 1.3311 0.0011
dipole: 3.4912
quadrupole: -94.1387 -73.1930 -85.9719
quadrupole: 0.0462 0.0024 -0.0031
quadrupole: -9.7042 11.2416 -1.5374 0.0462 0.0024 -0.0031
hfenergy: -1295.8360072 hartree
pointgroup: C01 [X(C8H6Cl1N1O1S1)]
dipole: -1.3676815 -0.1266355 0.0003828 debye
dipolederiv: -0.1429951 -0.0347664 -0.0000029 -0.1171968 -0.7275885 0.0000392 -0.0000422 0.0000301 -0.042851 -0.4658006 0.1635633 -0.0000422 0.3312305 -0.3481273 0.0000905 -0.0000994 0.0001952 0.0531056 -1.6302653 0.1377925 -0.0001688 0.2672048 -0.4756293 0.0000511 0.0005328 -0.0000081 -0.3048469 -1.2565459 0.0287636 0.0000331 -0.1611995 -0.7331233 0.0001616 0.0000205 0.000164 -0.1596595 0.6938274 -0.2447194 0.0000894 -0.5729822 -0.364869 0.0000797 0.000241 0.0000378 0.1311808 0.4883572 0.2121379 -0.0001168 0.4808643 -0.0219026 0.0000021 -0.0001524 0.0000162 -0.1160149 0.1309131 0.1034009 -0.0000016 0.1341225 1.077388 -0.0000351 -0.0000213 -0.0000168 -0.0986979 2.087054 -0.1549877 0.0001028 -0.1215216 1.1300664 -0.0002595 -0.0005704 -0.0001878 0.1443756 -0.0826074 -0.0352739 0.0000414 -0.0809671 0.0612438 -0.0000586 0.0000232 -0.0000845 -0.1076659 0.0465747 -0.1526088 0.000004 -0.1379937 0.4181459 -0.0000054 -0.0000682 -0.0000032 0.2106301 -0.0963242 0.0096104 0.0000205 0.0708619 -0.2142395 0.0000055 0.0000103 -0.0000191 -0.1111079 -0.0175141 0.0203924 0.0000012 -0.0551767 0.0283185 -0.0000408 -0.000015 -0.0000156 -0.1669651 -0.0374553 0.082487 -0.0001829 -0.0755028 0.1594832 -0.000082 -0.0000506 -0.0000513 0.1355227 0.1174129 -0.0586436 -0.0848309 0.0196437 -0.0172301 -0.0341934 -0.0475417 -0.0620764 -0.0345045 0.1173456 -0.0587877 0.0850763 0.0195929 -0.0171078 0.0341633 0.0477579 0.0619249 -0.0343127 0.1021936 -0.0324813 0.0000072 0.0079631 -0.0470595 0.0000506 0.0000003 0.0000643 0.1654879 0.0079307 -0.0577836 -0.000005 -0.0745507 0.0567437 0.000004 -0.000005 -0.0000012 0.1672929 -0.0621011 0.0719045 -0.0000247 0.0656074 0.0354875 0.0000273 -0.00002 0.0000313 0.1690308 unknown
polarizability: 164.8969187|-0.00304|143.8480724|0.0035513|-0.0172391|49.3024381 unknown
InChI: InChI=1S/C8H6ClNOS/c1-10-7-5(9)3-2-4-6(7)12-8(10)11/h2-4H,1H3
charge 0 multiplicity 1
18 atoms
Cl -1.48227 -2.734171 0.000254
S  1.402327 2.000695 -0.000331
O  3.418559 0.095098 -0.000069
N  1.171876 -0.67469 0.000498
C  -0.159207 -0.196796 0.000321
C  -0.237885 1.232576 -0.000027
C  -1.38651 -0.906109 0.000232
C  2.187865 0.303362 0.000398
C  -1.457136 1.928177 -0.00027
C  1.598173 -2.092715 0.001028
C  -2.619629 -0.224275 0.000043
C  -2.658999 1.187249 -0.000188
H  2.698624 -2.094874 0.001863
H  1.228546 -2.611722 -0.896842
H  1.227132 -2.611405 0.898484
H  -1.472181 3.021735 -0.000561
H  -3.545076 -0.806816 0.000011
H  -3.624109 1.70208 -0.000343
