program: Gaussian 09
title: 000174075
version: EM64L-G09RevD.01
frameworkgroup: C1[X(C15H18N4O3)]
method: RPBEPBE
basis: SDD
operation: Freq
keyword: #p
keyword: freq=noraman
keyword: PBEPBE/SDD
title: #p freq=noraman PBEPBE/SDD
converged: YES YES NO NO
title: Mulliken charges:
elementType: O O O N N N N C C C C C C C C C C C C C C C H H H H H H H H H H H H H H H H H H
charge: -0.289727 -0.287440 -0.296168 -0.135902 -0.472673 -0.083891 -0.376513 -0.401356 -0.381855 -0.378829 -0.391341 -0.397305 0.122579 0.317592 -0.534819 0.343617 -0.343661 0.012467 -0.354655 0.114155 0.289377 -0.489702 0.189275 0.221717 0.219735 0.201897 0.202652 0.207101 0.261896 0.205639 0.200848 0.253805 0.276756 0.250930 0.249597 0.372887 0.367460 0.246429 0.239948 0.247479
chargesum: 0.00000
title: Mulliken charges with hydrogens summed into heavy atoms:
elementType: O O O N N N N C C C C C C C C C C C C C C C
charge: -0.289727 -0.287440 -0.296168 -0.135902 -0.099786 -0.083891 -0.009053 0.009637 0.039778 0.030923 0.076193 0.057348 0.122579 0.317592 -0.258063 0.343617 -0.092731 0.012467 -0.105057 0.114155 0.289377 0.244154
polarizability: 3.53188106e+02 -9.85176614e+00 1.81198905e+02 9.90963874e+00 6.99091866e+00 1.25156278e+02
1716.lowfreq: -14.5211 -5.3023 -2.1014 -0.0010 -0.0006 0.0005 22.8669 42.3264 50.8550
frequency: 22.7353 42.2041 50.7547 57.2158 68.0134 77.5116 86.5352 103.6795 123.5727 162.6489 170.7369 196.1594 225.7897 247.6737 263.0518 278.6553 295.4255 330.8546 357.7628 365.0514 384.7714 399.1322 433.8515 439.6568 462.9791 500.1797 547.5632 573.8423 614.7605 645.1247 654.3205 670.5987 679.2751 687.9775 707.2936 718.8186 736.3502 754.4229 775.4057 799.8017 813.4023 830.7886 840.1525 848.9315 864.1880 899.4338 903.4264 911.8234 941.2398 948.6092 963.7860 978.0149 1002.3000 1037.4753 1047.6153 1086.3454 1087.0383 1119.8750 1120.2227 1127.6023 1147.5510 1153.2774 1154.8979 1179.8786 1204.8903 1221.4099 1229.2343 1249.9705 1256.8645 1273.2066 1279.2568 1292.9041 1329.2921 1336.1965 1341.2569 1348.5156 1361.5542 1376.0054 1395.1373 1407.4392 1432.0627 1450.2773 1453.8696 1454.1590 1454.3715 1463.9812 1465.5575 1465.9187 1472.9891 1473.5439 1487.2620 1542.1305 1567.7165 1596.7282 1628.1781 1655.4219 2953.2805 2961.0307 2966.0259 2982.3055 2988.9387 3009.1280 3035.1081 3044.7757 3054.9234 3090.4732 3096.0960 3113.0938 3140.9012 3155.3988 3161.7026 3170.3019 3516.3697 3559.7339
redmass: 4.9499 3.7091 3.8325 4.9457 2.9220 1.5834 3.6686 6.7373 4.0604 4.7295 3.4341 3.5233 6.0022 3.1221 4.8193 3.0991 4.8298 3.6998 4.9558 5.0992 2.7851 2.7374 3.3075 3.1424 3.9769 3.9384 2.3201 6.7213 3.9714 4.7616 1.4173 5.5261 11.2071 6.0978 3.7095 5.0912 5.4777 1.1920 3.4029 1.5059 3.4366 4.4652 1.6112 1.5181 2.9788 2.1774 2.6107 3.6781 2.7136 1.4490 1.3297 6.9868 2.5262 2.1393 4.1824 2.0001 1.3994 2.4853 1.2527 1.6074 1.6419 1.4694 1.5357 2.4738 1.9256 2.0139 2.1204 1.6060 1.4621 3.6796 1.2060 1.6369 1.2710 1.3467 1.5355 1.4386 1.3597 4.3313 3.5293 2.3812 1.4498 1.1584 2.2414 1.0706 1.2398 1.0874 1.1026 1.2094 2.5017 1.1020 3.2224 7.4971 5.7156 7.4447 7.3661 7.5089 1.0701 1.0687 1.0643 1.0607 1.0612 1.0297 1.0961 1.1026 1.1030 1.0941 1.0929 1.1053 1.0882 1.1048 1.0931 1.0964 1.0826 1.0774
irintensity: 1.9661 0.7376 0.2103 0.1355 1.1506 0.3448 1.3147 8.4567 1.1998 1.6565 4.6444 2.9212 9.6278 6.1191 4.5626 11.2119 26.7395 4.2182 8.4325 6.0964 2.6741 4.2764 2.4893 1.3812 1.0361 24.9382 1.3157 3.8087 4.7473 8.7583 68.5518 8.4253 4.5921 1.3926 44.3596 18.0775 16.6054 118.8306 7.6574 0.7435 5.3210 2.2160 24.0851 32.6766 3.4689 19.1018 16.0689 5.9674 12.8236 6.5774 1.6995 7.5568 60.8484 0.5786 81.9051 10.0905 0.6700 4.0129 0.1749 38.1034 74.5761 144.7238 7.4268 489.4727 16.3928 15.8824 15.0220 61.0089 34.8894 286.3896 18.3348 43.4373 0.5090 0.7026 17.8062 2.2252 34.9271 35.8259 99.4704 192.7508 22.3104 40.2620 9.0005 17.6854 7.3146 9.5317 17.3887 63.8723 78.7700 6.5021 37.7937 169.0491 555.5742 339.7563 87.7484 200.0260 31.2244 51.0564 62.9827 26.7078 34.4848 43.9183 64.4850 37.7599 84.2399 6.5583 16.1500 24.2264 8.0192 15.2664 0.9209 9.4532 162.8189 87.6725
temp: 298.150 k
press: 1.00000 atm
elementType: 8 8 8 7 7 7 7 6 6 6 6 6 6 6 6 6 6 6 6 6 6 6 1 1 1 1 1 1 1 1 1 1 1 1 1 1 1 1 1 1
symmnumber: 1
zpe: 841494.7 jmol-1
zpe.correction: 0.320508 hartree
zpe.thermalcorrener: 0.340339 hartree
zpe.thermalcorrenthalpy: 0.341284 hartree
zpe.thermalcorrgfe: 0.270434 hartree
zpe.sumelectzpe: -1025.506551 hartree
zpe.sumelectthermal: -1025.486720 hartree
zpe.sumelectthermalent: -1025.485776 hartree
zpe.sumelectthermalfe: -1025.556625 hartree
dipole: 1.9391 0.4787 3.3045
dipole: 3.8613
quadrupole: -77.6147 -131.9543 -135.1669
quadrupole: -13.4721 -5.0300 -4.8538
quadrupole: 37.2973 -17.0424 -20.2549 -13.4721 -5.0300 -4.8538
hfenergy: -1025.8270591 hartree
pointgroup: C01 [X(C15H18N4O3)]
dipole: -0.8462124 -0.6232936 -1.0969127 debye
polarizability: 353.5989012|3.2907555|151.9842708|-9.3497517|-29.1172166|153.9601167 unknown
InChI: InChI=1S/C15H18N4O3/c1-22-15(21)18-14-16-11-6-5-10(9-12(11)17-14)13(20)19-7-3-2-4-8-19/h5-6,9,17-18H,2-4,7-8H2,1H3
charge 0 multiplicity 1
40 atoms
O  2.724777 -0.329221 2.20751
O  -6.642074 -0.299759 0.147732
O  -4.803804 -1.341486 1.189629
N  3.819312 -0.100749 0.159976
N  -2.361335 -0.262054 0.50381
N  -2.484077 1.478339 -0.991744
N  -4.555993 0.457448 -0.308453
C  5.856868 -1.823131 -1.068413
C  5.77617 -1.638553 0.465128
C  4.460752 -1.636131 -1.70438
C  5.137518 -0.275795 0.816369
C  3.837931 -0.271046 -1.312028
C  2.674044 -0.065981 0.958629
C  1.364797 0.342487 0.328833
C  0.193603 -0.304536 0.792248
C  -1.033341 0.143201 0.279493
C  1.276761 1.434818 -0.591243
C  -1.132307 1.232604 -0.6582
C  0.040584 1.892646 -1.086499
C  -3.162244 0.56597 -0.275312
C  -5.28698 -0.471916 0.412434
C  -7.545593 -1.234067 0.858307
H  6.557192 -1.073093 -1.492407
H  6.264046 -2.820369 -1.320329
H  5.166147 -2.447471 0.911539
H  6.783767 -1.695311 0.91967
H  4.521039 -1.695245 -2.808452
H  3.786525 -2.447415 -1.365744
H  4.979197 -0.180261 1.902183
H  5.802835 0.544662 0.473895
H  4.436465 0.548236 -1.764701
H  2.812015 -0.19793 -1.702267
H  0.277635 -1.097903 1.540822
H  2.19512 1.954456 -0.884893
H  -0.021144 2.74183 -1.772871
H  -2.737519 -1.000415 1.105394
H  -5.046121 1.12153 -0.911353
H  -7.31985 -2.274583 0.571859
H  -8.553792 -0.943602 0.5331
H  -7.43123 -1.119904 1.94893
